Organism Group;Strain;Serovar;Isolate;Create Date;Location;Isolation Source;Isolation type;Host;SNP cluster;Min-same;Min-diff;BioSample;Assembly;AMR genotypes;;;;;;;;;;;;;;;;;
E.coli and Shigella;CVM N18EC0408;;PDT000566061.1;2019-08-16T15:35:00Z;USA:SD;ground turkey;environmental/other;;;;;SAMN12359670;;aac(3)-IX=COMPLETE;aph(3')-VI=COMPLETE;armA=COMPLETE;blaOXA-1=COMPLETE;;;;;;;;;;;;;;
Salmonella enterica;FSIS11808930;4,[5],12:i:-;PDT000303905.2;2018-04-06T21:39:36Z;USA:IL;animal-swine-market swine;environmental/other;;PDS000059916.8;21;19;SAMN08886776;GCA_010576325.1;aac(3)-IX=COMPLETE;aph(3')-VI=COMPLETE;armA=COMPLETE;blaOXA-1=COMPLETE;;;;;;;;;;;;;;
Salmonella enterica;FSIS1703077;Anatum;PDT000226582.2;2017-07-24T20:39:28Z;USA:MN;animal-swine-market swine;environmental/other;;PDS000043344.2;28;;SAMN07410416;;aac(3)-IX=COMPLETE;aph(3')-VI=COMPLETE;blaOXA-1=COMPLETE;;;;;;;;;;;;;;;
Morganella morganii;;;PDT000547782.1;2019-07-23T12:03:26Z;China;feces;environmental/other;;;;;SAMN12264953;GCA_007291315.1;aac(3)-IX=COMPLETE;ant(2'');blaOXA-1=COMPLETE;;;;;;;;;;;;;;;
Morganella morganii;28-16;-;PDT000620580.1;2019-10-30T18:34:14Z;Germany;clinical sample;clinical;Homo sapiens;PDS000052853.1;0;;SAMEA5949562;;aac(3)-IX=COMPLETE;ant(2'');blaOXA-1=COMPLETE;;;;;;;;;;;;;;;
Morganella morganii;SCsl21;;PDT000663295.1;2019-12-31T21:31:18Z;;;environmental/other;pig;;;;SAMN11928038;GCA_009822245.1;aac(6')-I;ant(2'');blaKPC-8=PARTIAL_END_OF_CONTIG;;;;;;;;;;;;;;;
Morganella morganii;SCsl4;;PDT000663296.1;2019-12-31T22:06:48Z;;liver;environmental/other;pig;;;;SAMN11928022;GCA_009822545.1;aac(6')-I;ant(4');;;;;;;;;;;;;;;;
Vibrio parahaemolyticus;PH698;;PDT000581206.1;2019-09-04T21:27:44Z;Philippines: Negros;;environmental/other;Penaeus vannamei;;;;SAMN12404565;GCA_008271865.1;aac(6')-II;aac(2')-Ia;;;;;;;;;;;;;;;;
Salmonella enterica;FSIS1606035;Johannesburg;PDT000122154.2;2016-04-01T14:14:21Z;USA:IA;animal-swine-market swine;environmental/other;;PDS000030487.15;16;18;SAMN04599774;GCA_008411905.1;aac(6')-I;aac(2')-Ia;blaOXA-1=COMPLETE;;;;;;;;;;;;;;;
E.coli and Shigella;CVM N18EC0408;;PDT000566061.1;2019-08-16T15:35:00Z;USA:SD;ground turkey;environmental/other;;;;;SAMN12359670;;blaOXA-1=COMPLETE;;;;;;;;;;;;;;;;;
Klebsiella oxytoca;;"""0000-0068-9263"",""474"",""SRS2407852""";;PDT000231452.1;2017-08-07T18:40:32Z;USA:Boston;wound;clinical;PDS000076186.2;34;;SAMN07450849;;aac(3)-IIa=COMPLETE;aac(6')-Ib-cr5=COMPLETE;aph(3'')-Ib=COMPLETE;aph(3')-Ia=COMPLETE;aph(6)-Id=COMPLETE;blaCTX-M-15=COMPLETE;blaOXA-1=COMPLETE;blaOXY-1-1=COMPLETE;blaTEM-1=COMPLETE;catB3=PARTIAL;dfrA14=COMPLETE;emrD=COMPLETE;oqxA=COMPLETE;oqxB=COMPLETE;qnrB1=COMPLETE;sul2=COMPLETE;tet(A)=COMPLETE;
Vibrio cholerae;;"""2012EL-2176"",""SRS599867""";;PDT000040555.1;2014-10-10T11:52:55Z;Haiti;;clinical;PDS000065830.13;0;0;SAMN02741837;GCA_000765415.1;aac(3)-IIe=COMPLETE;aadA16=COMPLETE;almG=COMPLETE;aph(3'')-Ib=COMPLETE;aph(6)-Id=COMPLETE;arr-3=COMPLETE;blaCMY-2=COMPLETE;blaIND-1;blaTEM-1=COMPLETE;catB9=COMPLETE;dfrA1=COMPLETE;dfrA27=COMPLETE;floR=COMPLETE;mph(A)=COMPLETE;sul1=COMPLETE;sul2=COMPLETE;tet(A)=COMPLETE;varG=COMPLETE
