[
  {
    "name": "car1",
    "price": 29,
    "urlPic": "/img/1_bmw.jpg",
    "articles": 1001,
    "color": "red"
  },
  {
    "name": "car2",
    "price": 39,
    "urlPic": "/img/2_merc.jpg",
    "articles": 1002,
    "color": "white"
  },
  {
    "name": "car3",
    "price": 49,
    "urlPic": "/img/3_audi.jpg",
    "articles": 1003,
    "color": "black"
  },
  {
    "name": "car4",
    "price": 59,
    "urlPic": "/img/4_mazda.jpg",
    "articles": 1004,
    "color": "yellow"
  },
  {
    "name": "car5",
    "price": 69,
    "urlPic": "/img/5_pont.jpg",
    "articles": 1005,
    "color": "white"
  },
  {
    "name": "car6",
    "price": 79,
    "urlPic": "/img/6_impa.jpg",
    "articles": 1006,
    "color": "white"
  },
  {
    "name": "car7",
    "price": 89,
    "urlPic": "/img/7_char.jpeg",
    "articles": 1007,
    "color": "white"
  },
  {
    "name": "car8",
    "price": 99,
    "urlPic": "/img/8_gto.jpg",
    "articles": 1008,
    "color": "white"
  },
  {
    "name": "car9",
    "price": 109,
    "urlPic": "/img/9_288.jfif",
    "articles": 1009,
    "color": "white"
  },
  {
    "name": "car10",
    "price": 119,
    "urlPic": "/img/10_pack.jpg",
    "articles": 1010,
    "color": "white"
  }
]