module gitlab.com/apconsulting/pkgs/rx

go 1.20

require github.com/google/uuid v1.3.0

require (
	github.com/cenkalti/backoff/v4 v4.2.0 // indirect
	github.com/davecgh/go-spew v1.1.1 // indirect
	github.com/emirpasic/gods v1.18.1 // indirect
	github.com/pmezard/go-difflib v1.0.0 // indirect
	github.com/reactivex/rxgo/v2 v2.5.0 // indirect
	github.com/stretchr/objx v0.5.0 // indirect
	github.com/stretchr/testify v1.8.2 // indirect
	github.com/teivah/onecontext v1.3.0 // indirect
	gopkg.in/yaml.v2 v2.4.0 // indirect
	gopkg.in/yaml.v3 v3.0.1 // indirect
)
