module gitlab.com/apconsulting/pkgs/res/resgate

go 1.13

require (
	github.com/golang/protobuf v1.5.2 // indirect
	github.com/gorilla/websocket v1.4.2
	github.com/jirenius/timerqueue v1.0.0
	github.com/nats-io/nats-server/v2 v2.6.6 // indirect
	github.com/nats-io/nats.go v1.13.1-0.20211122170419-d7c1d78a50fc
	github.com/posener/wstest v1.2.0
	github.com/rs/xid v1.3.0
	google.golang.org/protobuf v1.27.1 // indirect
)
