{
  "development": {
    "username": "satdcp",
    "password": "B4rhdfXsYFpHuEa4",
    "database": "UAT_EPAYMENT",
    "host": "10.0.1.11",
    "dialect": "mssql",
    "pool": {
      "max": 5,
      "min": 0,
      "acquire": 30000,
      "idle": 10000
    },
    "timezone" : "+7.00"
  },
  "test": {
    "username": "root",
    "password": null,
    "database": "database_test",
    "host": "127.0.0.1",
    "dialect": "mysql",
    "operatorsAliases": false
  },
  "production": {
    "username": "root",
    "password": null,
    "database": "database_production",
    "host": "127.0.0.1",
    "dialect": "mysql",
    "operatorsAliases": false
  }
}