<?xml version="1.0" encoding="UTF-8"?>
<svg width="20px" height="20px" viewBox="0 0 20 20" version="1.1" xmlns="http://www.w3.org/2000/svg" xmlns:xlink="http://www.w3.org/1999/xlink">
    <title>😶 Icon</title>
    <g id="เพิ่มกำหนดการประชุมคณะกรรมการผลิตภัณฑ์ประจำปี" stroke="none" stroke-width="1" fill="none" fill-rule="evenodd">
        <g id="5.รายละเอียดกำหนดการประชุมคณะกรรมการผลิตภัณฑ์-/-default-/-full-table" transform="translate(-2232.000000, -656.000000)" fill="#5AA700">
            <g id="Group-2" transform="translate(40.000000, 418.000000)">
                <g id="Group-7">
                    <g id="Group-10" transform="translate(0.000000, 30.000000)">
                        <g id="Stacked-Group" transform="translate(0.000000, 192.000000)">
                            <g id="Group-15" transform="translate(656.000000, 0.000000)">
                                <g id="Stacked-Group">
                                    <g id="Group-11">
                                        <g id="Component---Simple-/-Table-/-TH-/-Text-(C)-Copy-36" transform="translate(1526.000000, 0.000000)">
                                            <g id="Icon-/-Arrow-/-Up-/-Circle" transform="translate(10.000000, 16.000000)">
                                                <circle id="Oval" fill-opacity="0.2" cx="10" cy="10" r="10"></circle>
                                                <g id="up-arrow" stroke-width="1" transform="translate(10.000000, 10.000000) scale(1, -1) translate(-10.000000, -10.000000) translate(5.000000, 4.166667)">
                                                    <path d="M9.92982774,4.93480055 L5.16131258,0.0709559809 C5.11649142,0.0252616959 5.05596276,0 4.99257411,0 C4.92918547,0 4.86863446,0.0257628297 4.82383564,0.0714343359 L0.0695980075,4.93480055 C0.00142784495,5.00429869 -0.0185919734,5.10876229 0.0181184747,5.19964973 C0.0552981373,5.29051438 0.142058131,5.34932926 0.238336476,5.34932926 L2.8599719,5.34932926 L2.8599719,11.4236851 C2.8599719,11.5578068 2.96675172,11.6666667 3.09831052,11.6666667 L6.9116167,11.6666667 C7.0431755,11.6666667 7.14995531,11.5578068 7.14995531,11.4236851 L7.14995531,5.34930648 L9.76158083,5.34930648 C9.85785918,5.34930648 9.94461917,5.29001325 9.98179883,5.19914859 C10.0189785,5.10828394 9.99799791,5.00429869 9.92982774,4.93480055 Z" id="Path" transform="translate(5.000000, 5.833333) scale(1, -1) translate(-5.000000, -5.833333) "></path>
                                                </g>
                                            </g>
                                        </g>
                                    </g>
                                </g>
                            </g>
                        </g>
                    </g>
                </g>
            </g>
        </g>
    </g>
</svg>