<?xml version="1.0" encoding="UTF-8"?>
<svg width="20px" height="19px" viewBox="0 0 20 19" version="1.1" xmlns="http://www.w3.org/2000/svg" xmlns:xlink="http://www.w3.org/1999/xlink">
    <title>powerpoint</title>
    <g id="Symbols" stroke="none" stroke-width="1" fill="none" fill-rule="evenodd">
        <g id="Icon-/-Document-/-Powerpont" transform="translate(-2.000000, -3.000000)" fill-rule="nonzero">
            <g id="powerpoint" transform="translate(2.000000, 3.000000)">
                <g id="Group" fill="#FF5722">
                    <path d="M13.8969848,3.99700144 C13.6776982,3.99700144 13.4999164,4.17478326 13.4999164,4.39406984 L13.4999164,6.77640584 C13.4999164,6.99569242 13.6776982,7.17347425 13.8969848,7.17347425 L16.2793208,7.17347425 C16.4986074,7.17347425 16.6763892,6.99569242 16.6763892,6.77640584 C16.676352,5.24139975 15.4319909,3.99700144 13.8969848,3.99700144 Z" id="Path"></path>
                    <path d="M13.8969848,7.96757384 C13.239125,7.96757384 12.7058168,7.43426559 12.7058168,6.77640584 L12.7058168,4.83163796 C11.1895716,5.04731382 10.1352762,6.45132865 10.3509521,7.96757384 C10.566628,9.48381902 11.9706428,10.5381144 13.486888,10.3224385 C14.7082819,10.1486769 15.667991,9.18896772 15.8417527,7.96757384 L13.8969848,7.96757384 Z" id="Path"></path>
                    <path d="M10.9682749,0.112193136 C10.874061,0.0356605919 10.7500306,0.00640252798 10.6315838,0.0327943439 L0.308140271,2.41513034 C0.126449928,2.45689567 -0.001749528,2.61941565 -1.76890644e-05,2.80583344 L-1.76890644e-05,16.3057498 C-1.76890644e-05,16.5016597 0.143051832,16.6682743 0.336691079,16.6980535 L10.6601346,18.28629 C10.87689,18.3196054 11.0796119,18.1709328 11.1129274,17.9542147 C11.1159797,17.9342998 11.117545,17.9141616 11.117545,17.8940234 L11.117545,0.423497447 C11.1179154,0.302407775 11.0629355,0.18779508 10.9682749,0.112193136 Z" id="Path"></path>
                    <path d="M18.6616568,16.702781 L10.720512,16.702781 C10.5012254,16.702781 10.3234436,16.5249992 10.3234436,16.3057126 C10.3234436,16.086426 10.5012254,15.9086442 10.720512,15.9086442 L18.2645884,15.9086442 L18.2645884,2.40876503 L10.720512,2.40876503 C10.5012254,2.40876503 10.3234436,2.23098321 10.3234436,2.01169663 C10.3234436,1.79241004 10.5012254,1.61466544 10.720512,1.61466544 L18.6616195,1.61466544 C18.8809061,1.61466544 19.058688,1.79244727 19.058688,2.01173385 L19.058688,16.3057498 C19.058688,16.5250364 18.8809434,16.702781 18.6616568,16.702781 Z" id="Path"></path>
                    <path d="M16.2793208,14.320445 L10.720512,14.320445 C10.5012254,14.320445 10.3234436,14.1426632 10.3234436,13.9233766 C10.3234436,13.70409 10.5012254,13.5263082 10.720512,13.5263082 L16.2792836,13.5263082 C16.4985701,13.5263082 16.676352,13.70409 16.676352,13.9233766 C16.676352,14.1427004 16.4986074,14.320445 16.2793208,14.320445 Z" id="Path"></path>
                    <path d="M16.2793208,11.938109 L10.720512,11.938109 C10.5012254,11.938109 10.3234436,11.7603272 10.3234436,11.5410406 C10.3234436,11.321754 10.5012254,11.1439722 10.720512,11.1439722 L16.2792836,11.1439722 C16.4985701,11.1439722 16.676352,11.321754 16.676352,11.5410406 C16.676352,11.7603644 16.4986074,11.938109 16.2793208,11.938109 Z" id="Path"></path>
                </g>
                <path d="M3.57350399,12.7322458 C3.35421741,12.7322458 3.17643558,12.554464 3.17643558,12.3351774 L3.17643558,5.98226902 C3.17643558,5.76298244 3.35421741,5.58520062 3.57350399,5.58520062 L5.16174039,5.58520062 C6.25817331,5.58520062 7.14700798,6.47403529 7.14700798,7.5704682 L7.14700798,8.36456779 C7.14700798,9.46100071 6.25817331,10.3498354 5.16174039,10.3498354 L3.9705724,10.3498354 L3.9705724,12.335103 C3.9705724,12.554464 3.7928278,12.7322458 3.57350399,12.7322458 Z M3.9705724,9.55577302 L5.16174039,9.55577302 C5.81960015,9.55577302 6.35290839,9.02246477 6.35290839,8.36460502 L6.35290839,7.57050543 C6.35290839,6.91264568 5.81960015,6.37933743 5.16174039,6.37933743 L3.9705724,6.37933743 L3.9705724,9.55577302 Z" id="Shape" fill="#FAFAFA"></path>
            </g>
        </g>
    </g>
</svg>