<?xml version="1.0" encoding="UTF-8"?>
<svg width="40px" height="40px" viewBox="0 0 40 40" version="1.1" xmlns="http://www.w3.org/2000/svg" xmlns:xlink="http://www.w3.org/1999/xlink">
    <title>77FB0631-A87E-48A7-A875-FDB66DB3526A</title>
    <g id="✅-Login" stroke="none" stroke-width="1" fill="none" fill-rule="evenodd">
        <g id="Login-/-Edit-Color-+-Picture" transform="translate(-724.000000, -542.000000)" fill="#00A6E6">
            <g id="Group-9" transform="translate(700.000000, 140.000000)">
                <g id="Group-7" transform="translate(0.000000, 152.000000)">
                    <g id="Group" transform="translate(0.000000, 137.000000)">
                        <g id="Icon-/-Lock" transform="translate(24.000000, 113.000000)">
                            <path d="M20.5,7.16666667 C24.2488419,7.16666667 27.309388,10.1136115 27.4914332,13.8172961 L27.5,14.1666667 L27.4993333,17.6666667 L28.6666667,17.6666667 C30.5352301,17.6666667 32.0617931,19.1309443 32.1614878,20.9746315 L32.1666667,21.1666667 L32.1666667,29.3333333 C32.1666667,31.26633 30.5996633,32.8333333 28.6666667,32.8333333 L28.6666667,32.8333333 L12.3333333,32.8333333 C10.4003367,32.8333333 8.83333333,31.26633 8.83333333,29.3333333 L8.83333333,29.3333333 L8.83333333,21.1666667 C8.83333333,19.23367 10.4003367,17.6666667 12.3333333,17.6666667 L12.3333333,17.6666667 L13.4993333,17.6666667 L13.5,14.1666667 C13.5,10.3006734 16.6340068,7.16666667 20.5,7.16666667 Z M28.6666667,20 L12.3333333,20 C11.6890011,20 11.1666667,20.5223345 11.1666667,21.1666667 L11.1666667,21.1666667 L11.1666667,29.3333333 C11.1666667,29.9776655 11.6890011,30.5 12.3333333,30.5 L12.3333333,30.5 L28.6666667,30.5 C29.3109989,30.5 29.8333333,29.9776655 29.8333333,29.3333333 L29.8333333,29.3333333 L29.8333333,21.1666667 C29.8333333,20.5223345 29.3109989,20 28.6666667,20 L28.6666667,20 Z M20.5,9.5 C18.0181278,9.5 15.9887685,11.4374381 15.8418501,13.8823863 L15.8333333,14.1666667 L15.8333333,17.6666667 L25.1663333,17.6666667 L25.1666667,14.1666667 C25.1666667,11.5893378 23.0773288,9.5 20.5,9.5 Z"></path>
                        </g>
                    </g>
                </g>
            </g>
        </g>
    </g>
</svg>