<?xml version="1.0" encoding="UTF-8"?>
<svg width="21px" height="19px" viewBox="0 0 21 19" version="1.1" xmlns="http://www.w3.org/2000/svg" xmlns:xlink="http://www.w3.org/1999/xlink">
    <title>excel</title>
    <g id="Symbols" stroke="none" stroke-width="1" fill="none" fill-rule="evenodd">
        <g id="Icon-/-Document-/-Excel" transform="translate(-2.000000, -3.000000)" fill-rule="nonzero">
            <g id="excel" transform="translate(2.000000, 3.000000)">
                <g id="Group" fill="#4CAF50">
                    <path d="M11.3147904,0.1157376 C11.2176,0.0367872 11.0896512,0.0066048 10.9674624,0.0338304 L0.3178752,2.4914304 C0.1304448,2.5345152 -0.0018048,2.7021696 -1.82479066e-05,2.8944768 L-1.82479066e-05,16.8208896 C-1.82479066e-05,17.0229888 0.1475712,17.1948672 0.347328,17.2255872 L10.9969152,18.864 C11.2205184,18.898368 11.4296448,18.7449984 11.4640128,18.5214336 C11.4671616,18.5008896 11.4687763,18.4801152 11.4687763,18.4593408 L11.4687763,0.4368768 C11.4691584,0.3119616 11.4124416,0.193728 11.3147904,0.1157376 Z" id="Path"></path>
                    <path d="M19.2512256,17.230464 L11.0592,17.230464 C10.8329856,17.230464 10.6495872,17.0470656 10.6495872,16.8208512 C10.6495872,16.5946368 10.8329856,16.4112384 11.0592,16.4112384 L18.8416128,16.4112384 L18.8416128,2.484864 L11.0592,2.484864 C10.8329856,2.484864 10.6495872,2.3014656 10.6495872,2.0752512 C10.6495872,1.8490368 10.8329856,1.6656768 11.0592,1.6656768 L19.2511872,1.6656768 C19.4774016,1.6656768 19.6608,1.8490752 19.6608,2.0752896 L19.6608,16.8208896 C19.6608,17.047104 19.47744,17.230464 19.2512256,17.230464 Z" id="Path"></path>
                </g>
                <g id="Group" transform="translate(3.264000, 5.721600)" fill="#FAFAFA">
                    <path d="M4.5184128,7.4128896 C4.3771776,7.4128896 4.2459264,7.3401216 4.1710848,7.2203904 L0.075072,0.6667776 C-0.0508416,0.478848 -0.0005376,0.2244096 0.187392,0.098496 C0.3753216,-0.0274176 0.62976,0.0228864 0.7556736,0.210816 C0.7606272,0.2181888 0.765312,0.2257152 0.7697664,0.2333952 L4.8657792,6.787008 C4.9852032,6.9791232 4.9262976,7.23168 4.7341824,7.3511424 C4.6694016,7.3913856 4.5946752,7.4127744 4.5184128,7.4128896 Z" id="Path"></path>
                    <path d="M0.4224,7.41288974 C0.1961856,7.4124288 0.0131712,7.2286848 0.0136311317,7.0024704 C0.0137856,6.9259776 0.0353664,6.8510592 0.0758784,6.7862016 L4.1718912,0.2325888 C4.2853248,0.036864 4.5359616,-0.0298368 4.731648,0.0835968 C4.9273728,0.1970304 4.9940736,0.4476672 4.88064,0.6433536 C4.8761856,0.6510336 4.8715008,0.65856 4.8665472,0.6659328 L0.7705728,7.2195456 C0.6957696,7.3398528 0.564096,7.4130048 0.4224,7.41288974 Z" id="Path"></path>
                </g>
                <g id="Group" transform="translate(10.636800, 1.651200)" fill="#4CAF50">
                    <path d="M3.6992256,15.579264 C3.4730112,15.579264 3.2896128,15.3958656 3.2896128,15.1696512 L3.2896128,0.4240512 C3.2896128,0.1978368 3.4730112,0.0144384 3.6992256,0.0144384 C3.92544,0.0144384 4.1088384,0.1978368 4.1088384,0.4240512 L4.1088384,15.1696512 C4.1088,15.395904 3.92544,15.579264 3.6992256,15.579264 Z" id="Path"></path>
                    <path d="M8.6144256,13.121664 L0.4224,13.121664 C0.1961856,13.121664 0.0127872,12.9382656 0.0127872,12.7120512 C0.0127872,12.4858368 0.1961856,12.3024384 0.4224,12.3024384 L8.6143872,12.3024384 C8.8406016,12.3024384 9.024,12.4858368 9.024,12.7120512 C9.024,12.938304 8.84064,13.121664 8.6144256,13.121664 Z" id="Path"></path>
                    <path d="M8.6144256,10.664064 L0.4224,10.664064 C0.1961856,10.664064 0.0127872,10.4806656 0.0127872,10.2544512 C0.0127872,10.0282368 0.1961856,9.8448384 0.4224,9.8448384 L8.6143872,9.8448384 C8.8406016,9.8448384 9.024,10.0282368 9.024,10.2544512 C9.024,10.480704 8.84064,10.664064 8.6144256,10.664064 Z" id="Path"></path>
                    <path d="M8.6144256,8.206464 L0.4224,8.206464 C0.1961856,8.206464 0.0127872,8.0230656 0.0127872,7.7968512 C0.0127872,7.5706368 0.1961856,7.3872384 0.4224,7.3872384 L8.6143872,7.3872384 C8.8406016,7.3872384 9.024,7.5706368 9.024,7.7968512 C9.024,8.023104 8.84064,8.206464 8.6144256,8.206464 Z" id="Path"></path>
                    <path d="M8.6144256,5.748864 L0.4224,5.748864 C0.1961856,5.748864 0.0127872,5.5654656 0.0127872,5.3392512 C0.0127872,5.1130368 0.1961856,4.9296384 0.4224,4.9296384 L8.6143872,4.9296384 C8.8406016,4.9296384 9.024,5.1130368 9.024,5.3392512 C9.024,5.5654656 8.84064,5.748864 8.6144256,5.748864 Z" id="Path"></path>
                    <path d="M8.6144256,3.291264 L0.4224,3.291264 C0.1961856,3.291264 0.0127872,3.1078656 0.0127872,2.8816512 C0.0127872,2.6554368 0.1961856,2.4720384 0.4224,2.4720384 L8.6143872,2.4720384 C8.8406016,2.4720384 9.024,2.6554368 9.024,2.8816512 C9.024,3.107904 8.84064,3.291264 8.6144256,3.291264 Z" id="Path"></path>
                </g>
            </g>
        </g>
    </g>
</svg>