<?xml version="1.0" encoding="UTF-8"?>
<svg width="24px" height="24px" viewBox="0 0 24 24" version="1.1" xmlns="http://www.w3.org/2000/svg" xmlns:xlink="http://www.w3.org/1999/xlink">
    <title>Icon / Clock</title>
    <g id="-Action-Button" stroke="none" stroke-width="1" fill="none" fill-rule="evenodd">
        <g id="[Action]-Alert-Timeout-/-Unsave" transform="translate(-596.000000, -385.000000)" fill="#EDAE2B">
            <g id="Group-12" transform="translate(480.000000, 368.000000)">
                <g id="Group-3" transform="translate(114.000000, 14.000000)">
                    <g id="Icon-/-Clock" transform="translate(0.000000, 1.000000)">
                        <path d="M14,2.33333333 C20.4433221,2.33333333 25.6666667,7.55667792 25.6666667,14 C25.6666667,20.4433221 20.4433221,25.6666667 14,25.6666667 C7.55667792,25.6666667 2.33333333,20.4433221 2.33333333,14 C2.33333333,7.55667792 7.55667792,2.33333333 14,2.33333333 Z M14,4.45454545 C8.72819102,4.45454545 4.45454545,8.72819102 4.45454545,14 C4.45454545,19.271809 8.72819102,23.5454545 14,23.5454545 C19.271809,23.5454545 23.5454545,19.271809 23.5454545,14 C23.5454545,8.72819102 19.271809,4.45454545 14,4.45454545 Z M14,6.57575758 C14.5439168,6.57575758 14.9922046,6.98519414 15.0534706,7.51267456 L15.0606061,7.63636364 L15.0606061,13.3445455 L18.7167417,15.1725772 C19.2032357,15.4158242 19.4210908,15.9825158 19.2399924,16.4817076 L19.1910591,16.5955296 C18.9478122,17.0820235 18.3811206,17.2998787 17.8819287,17.1187803 L17.7681068,17.069847 L13.5256826,14.9486349 C13.2062902,14.7889387 12.9914661,14.4810228 12.9476705,14.1324223 L12.9393939,14 L12.9393939,7.63636364 C12.9393939,7.05060708 13.4142434,6.57575758 14,6.57575758 Z" id="Shape"></path>
                    </g>
                </g>
            </g>
        </g>
    </g>
</svg>