{
  "description": "One web source with both web and app destination. 2 triggers - 1 with app, 1 with web destination. Event report task within the expiry window sends two reports, one for each trigger.",
  "phflags_override": {
    "measurement_flex_api_max_information_gain_dual_destination_event": "9",
    "measurement_flex_api_max_information_gain_dual_destination_navigation": "14"
  },
  "input": {
    "web_sources": [{
      "registration_request": {
        "source_origin": "android-app://example.1s1.test",
        "source_type": "navigation",
        "web_destination": "https://example.1d1.test",
        "app_destination": "android-app://com.example.2d1",
        "registrant": "example.1s1.test",
        "source_params": [{
          "attribution_src_url": "https://www.ad-tech1.test"
        }]
      },
      "responses": [{
        "url": "https://www.ad-tech1.test",
        "response": {
          "Attribution-Reporting-Register-Source": {
            "source_event_id": "1",
            "destination": "android-app://com.example.2d1",
            "web_destination": "https://example.1d1.test",
            "priority": "100",
            "expiry": "172801"
          },
          "Location": null,
          "Attribution-Reporting-Redirect": null
        }
      }],
      "timestamp": "800000000001"
    }],
    "web_triggers": [{
      "registration_request": {
        "destination_origin": "https://example.1d1.test",
        "registrant": "example.2d1.test",
        "trigger_params": [{
          "attribution_src_url": "https://www.ad-tech1.test"
        }]
      },
      "responses": [{
        "url": "https://www.ad-tech1.test",
        "response": {
          "Attribution-Reporting-Register-Trigger": {
            "event_trigger_data": [
              {
                "trigger_data": "1",
                "priority": "101"
              }
            ]
          },
          "Location": null
        }
      }],
      "timestamp": "800001200001"
    }],
    "triggers" : [{
      "registration_request": {
        "registrant": "com.example.2d1"
      },
      "responses": [{
        "url": "https://www.ad-tech1.test",
        "response": {
          "Attribution-Reporting-Register-Trigger": {
            "event_trigger_data": [
              {
                "trigger_data": "2",
                "priority": "102"
              }
            ]
          },
          "Location": null
        }
      }],
      "timestamp": "800000600001"
    }]
  },
  "output": {
    "event_level_results": [{
      "report_time": "800172800001",
      "report_url": "https://www.ad-tech1.test/.well-known/attribution-reporting/report-event-attribution",
      "payload": {
        "attribution_destination": "android-app://com.example.2d1",
        "scheduled_report_time": "800172800",
        "source_event_id": "1",
        "trigger_data": "2",
        "source_type": "navigation",
        "randomized_trigger_rate": 0.0054129
      }
    }, {
      "report_time": "800172800001",
      "report_url": "https://www.ad-tech1.test/.well-known/attribution-reporting/report-event-attribution",
      "payload": {
        "attribution_destination": "https://1d1.test",
        "scheduled_report_time": "800172800",
        "source_event_id": "1",
        "trigger_data": "1",
        "source_type": "navigation",
        "randomized_trigger_rate": 0.0054129
      }
    }],
    "aggregatable_results": []
  }
}
