{
  "description": "value sum on event case, value is not enough for report. Some trigger may be ignored due to trigger data mismatch",
  "phflags_override": {
    "measurement_flexible_event_reporting_api_enabled": "true"
  },
  "input": {
    "sources": [
      {
        "registration_request": {
          "source_type": "event",
          "registrant": "example.1s1.test"
        },
        "responses": [
          {
            "url": "https://www.ad-tech1.test",
            "response": {
              "Attribution-Reporting-Register-Source": {
                "source_event_id": "2",
                "destination": "android-app://example.2d1.test",
                "priority": "20",
                "expiry": "172801",
                "trigger_specs": [
                  {
                    "trigger_data": [
                      0,
                      1
                    ],
                    "event_report_windows": {
                      "start_time": 0,
                      "end_times": [
                        172800
                      ]
                    },
                    "summary_window_operator": "value_sum",
                    "summary_buckets": [
                      10
                    ]
                  }
                ],
                "max_event_level_reports": 1,
                "trigger_data_matching": "exact"
              },
              "Location": null,
              "Attribution-Reporting-Redirect": null
            }
          }
        ],
        "timestamp": "1800000600001"
      }
    ],
    "triggers": [
      {
        "registration_request": {
          "registrant": "example.2d1.test"
        },
        "responses": [
          {
            "url": "https://www.ad-tech1.test",
            "response": {
              "Attribution-Reporting-Register-Trigger": {
                "event_trigger_data": [
                  {
                    "trigger_data": "0",
                    "priority": "100",
                    "deduplication_key": "10",
                    "value": 9
                  }
                ]
              },
              "Location": null,
              "Attribution-Reporting-Redirect": null
            }
          }
        ],
        "timestamp": "1800001800001"
      },
      {
        "registration_request": {
          "registrant": "example.2d1.test"
        },
        "responses": [
          {
            "url": "https://www.ad-tech1.test",
            "response": {
              "Attribution-Reporting-Register-Trigger": {
                "event_trigger_data": [
                  {
                    "trigger_data": "3",
                    "priority": "101",
                    "deduplication_key": "11",
                    "value": 1000
                  }
                ]
              },
              "Location": null,
              "Attribution-Reporting-Redirect": null
            }
          }
        ],
        "timestamp": "1800003600001"
      },
      {
        "registration_request": {
          "registrant": "example.2d1.test"
        },
        "responses": [
          {
            "url": "https://www.ad-tech1.test",
            "response": {
              "Attribution-Reporting-Register-Trigger": {
                "event_trigger_data": [
                  {
                    "trigger_data": "4",
                    "priority": "200",
                    "deduplication_key": "9",
                    "value": 1
                  }
                ]
              },
              "Location": null,
              "Attribution-Reporting-Redirect": null
            }
          }
        ],
        "timestamp": "1800007200001"
      }
    ]
  },
  "output": {
    "event_level_results": [],
    "aggregatable_results": []
  }
}
