{
  "description": "One source with source type \"navigation\", and four matching triggers of equal priority are registered. Event report task within the expiry window sends the data corresponding to the first three triggers only.",
  "input": {
    "sources": [{
      "registration_request": {
        "source_type": "navigation",
        "registrant": "example.1s1.test"
      },
      "responses": [{
        "url": "https://www.ad-tech1.test",
        "response": {
          "Attribution-Reporting-Register-Source": {
            "source_event_id": "1",
            "destination": "android-app://example.2d1.test",
            "priority": "100",
            "expiry": "172801"
          },
          "Location": null,
          "Attribution-Reporting-Redirect": null
        }
      }],
      "timestamp": "800000000001"
    }],
    "triggers": [
      {
        "registration_request": {
          "registrant": "example.2d1.test"
        },
        "responses": [{
          "url": "https://www.ad-tech1.test",
          "response": {
            "Attribution-Reporting-Register-Trigger": {
              "event_trigger_data": [
                {
                  "trigger_data": "1",
                  "priority": "101"
                }
              ]
            },
            "Location": null,
            "Attribution-Reporting-Redirect": null
          }
        }],
        "timestamp": "800000600001"
      },
      {
        "registration_request": {
          "registrant": "example.2d1.test"
        },
        "responses": [{
          "url": "https://www.ad-tech1.test",
          "response": {
            "Attribution-Reporting-Register-Trigger": {
              "event_trigger_data": [
                {
                  "trigger_data": "2",
                  "priority": "101"
                }
              ]
            },
            "Location": null,
            "Attribution-Reporting-Redirect": null
          }
        }],
        "timestamp": "800001200001"
      },
      {
        "registration_request": {
          "registrant": "example.2d1.test"
        },
        "responses": [{
          "url": "https://www.ad-tech1.test",
          "response": {
            "Attribution-Reporting-Register-Trigger": {
              "event_trigger_data": [
                {
                  "trigger_data": "3",
                  "priority": "101"
                }
              ]
            },
            "Location": null,
            "Attribution-Reporting-Redirect": null
          }
        }],
        "timestamp": "800001800001"
      },
      {
        "registration_request": {
          "registrant": "example.2d1.test"
        },
        "responses": [{
          "url": "https://www.ad-tech1.test",
          "response": {
            "Attribution-Reporting-Register-Trigger": {
              "event_trigger_data": [
                {
                  "trigger_data": "4",
                  "priority": "101"
                }
              ]
            },
            "Location": null,
            "Attribution-Reporting-Redirect": null
          }
        }],
        "timestamp": "800002400001"
      }
    ]
  },
  "output": {
    "event_level_results": [
      {
        "report_time": "800172800001",
        "report_url": "https://www.ad-tech1.test/.well-known/attribution-reporting/report-event-attribution",
        "payload": {
          "attribution_destination": "android-app://example.2d1.test",
          "scheduled_report_time": "800172800",
          "source_event_id": "1",
          "trigger_data": "1",
          "source_type": "navigation",
          "randomized_trigger_rate": 0.0008051
        }
      },
      {
        "report_time": "800172800001",
        "report_url": "https://www.ad-tech1.test/.well-known/attribution-reporting/report-event-attribution",
        "payload": {
          "attribution_destination": "android-app://example.2d1.test",
          "scheduled_report_time": "800172800",
          "source_event_id": "1",
          "trigger_data": "2",
          "source_type": "navigation",
          "randomized_trigger_rate": 0.0008051
        }
      },
      {
        "report_time": "800172800001",
        "report_url": "https://www.ad-tech1.test/.well-known/attribution-reporting/report-event-attribution",
        "payload": {
          "attribution_destination": "android-app://example.2d1.test",
          "scheduled_report_time": "800172800",
          "source_event_id": "1",
          "trigger_data": "3",
          "source_type": "navigation",
          "randomized_trigger_rate": 0.0008051
        }
      }
    ],
    "aggregatable_results": []
  }
}
