{
  "mocks": [
    {
      "request": {
        "path": "/bidding"
      },
      "response": {
        "body": "BiddingLogicV2.js"
      }
    },
    {
      "request": {
        "path": "/scoring"
      },
      "response": {
        "body": "ScoringLogic.js"
      }
    },
    {
      "request": {
        "path": "/scoring/trusted"
      },
      "response": {
        "body": "ScoringSignals.json"
      }
    },
    {
      "request": {
        "path": "/bidding/trusted"
      },
      "response": {
        "body": "BiddingSignals.json"
      }
    },
    {
      "request": {
        "path": "/buyer/reportImpression?ca=shoes"
      },
      "response": {
        "body": "DefaultResponse.txt"
      },
      "verify_called": true
    },
    {
      "request": {
        "path": "/seller/reportImpression?render_uri={base_url_with_prefix}/render/shoes/0?bid=10"
      },
      "response": {
        "body": "DefaultResponse.txt"
      },
      "verify_called": true
    }
  ],
  "substitutions": {
    "<daily-update-uri>": "{base_url_with_prefix}/bidding/daily",
    "<ad-render-uri-1>": "{base_url_with_prefix}/render_ad/1",
    "<ad-render-uri-2>": "{base_url_with_prefix}/render_ad/2",
    "<buyer-trusted-bidding-uri>": "{base_url_with_prefix}/bidding/trusted",
    "<buyer-reporting-uri>": "{base_url_with_prefix}/buyer/reportImpression",
    "<seller-reporting-uri>": "{base_url_with_prefix}/seller/reportImpression"
  }
}
