{
  "name": "With origin and domain - preserve",
  "description": "(S3, S7), (T3), (E2, E3) AND (A1, A4, A5, A6, A7 ) deleted due to origin/domain mismatch; S2,T2, E5 AND A2 is not delete due to being out of time range",
  "input": {
    "sources": [
      {
        "id": "S1",
        "eventId": 1,
        "sourceType": "navigation",
        "publisher": "https://deleteCandidate1.site.test",
        "enrollmentId": "enrollment-id",
        "eventTime": 1648665733601,
        "expiryTime": 1648665733611,
        "eventReportWindow": 1648665733611,
        "priority": 100,
        "status": 0,
        "registrant": "android-app://com.registrant.deleteCandidate"
      },
      {
        "id": "S2",
        "eventId": 2,
        "sourceType": "navigation",
        "publisher": "https://deleteCandidate1.site.test",
        "enrollmentId": "enrollment-id",
        "eventTime": 1648665733605,
        "expiryTime": 1648665733615,
        "eventReportWindow": 1648665733615,
        "priority": 100,
        "status": 0,
        "registrant": "android-app://com.registrant.deleteCandidate"
      },
      {
        "id": "S3",
        "eventId": 3,
        "sourceType": "navigation",
        "publisher": "https://siteNotMatch.site3.test",
        "enrollmentId": "enrollment-id",
        "eventTime": 1648665733601,
        "expiryTime": 1648665733611,
        "eventReportWindow": 1648665733611,
        "priority": 100,
        "status": 0,
        "registrant": "android-app://com.registrant.deleteCandidate"
      },
      {
        "id": "S4",
        "eventId": 1,
        "sourceType": "navigation",
        "publisher": "https://deleteCandidate2.site.test",
        "enrollmentId": "enrollment-id",
        "eventTime": 1648665733601,
        "expiryTime": 1648665733611,
        "eventReportWindow": 1648665733611,
        "priority": 100,
        "status": 0,
        "registrant": "android-app://com.registrant.deleteCandidate"
      },
      {
        "id": "S5",
        "eventId": 1,
        "sourceType": "navigation",
        "publisher": "https://abc.deletesite1.test",
        "enrollmentId": "enrollment-id",
        "eventTime": 1648665733601,
        "expiryTime": 1648665733611,
        "eventReportWindow": 1648665733611,
        "priority": 100,
        "status": 0,
        "registrant": "android-app://com.registrant.deleteCandidate"
      },
      {
        "id": "S6",
        "eventId": 1,
        "sourceType": "navigation",
        "publisher": "https://abc.deletesite2.test",
        "enrollmentId": "enrollment-id",
        "eventTime": 1648665733601,
        "expiryTime": 1648665733611,
        "eventReportWindow": 1648665733611,
        "priority": 100,
        "status": 0,
        "registrant": "android-app://com.registrant.deleteCandidate"
      },
      {
        "id": "S7",
        "eventId": 1,
        "sourceType": "navigation",
        "publisher": "https://somedeletesite2.test",
        "enrollmentId": "enrollment-id",
        "eventTime": 1648665733601,
        "expiryTime": 1648665733611,
        "eventReportWindow": 1648665733611,
        "priority": 100,
        "status": 0,
        "registrant": "android-app://com.registrant.deleteCandidate"
      }
    ],
    "source_destinations": [
      {
        "sourceId": "S1",
        "destination": "android-app://com.app2",
        "destinationType": 0
      },
      {
        "sourceId": "S2",
        "destination": "android-app://com.app2",
        "destinationType": 0
      },
      {
        "sourceId": "S3",
        "destination": "https://site2.test",
        "destinationType": 0
      },
      {
        "sourceId": "S4",
        "destination": "android-app://com.app2",
        "destinationType": 0
      },
      {
        "sourceId": "S5",
        "destination": "android-app://com.app2",
        "destinationType": 0
      },
      {
        "sourceId": "S6",
        "destination": "android-app://com.app2",
        "destinationType": 0
      },
      {
        "sourceId": "S7",
        "destination": "android-app://com.app2",
        "destinationType": 0
      }
    ],
    "triggers": [
      {
        "id": "T1",
        "attributionDestination": "https://deleteCandidate1.site.test",
        "enrollmentId": "enrollment-id",
        "priority": 101,
        "status": 0,
        "triggerData": 2,
        "eventTriggers": [
          {
            "trigger_data": 2,
            "priority": 101,
            "filters": {
              "key_1": ["value_1"]
            }
          }
        ],
        "triggerTime": 1648665733601,
        "registrant": "android-app://com.registrant.deleteCandidate",
        "aggregatableSourceRegistrationTimeConfig": "INCLUDE"
      },
      {
        "id": "T2",
        "attributionDestination": "https://deleteCandidate1.site.test",
        "enrollmentId": "enrollment-id",
        "priority": 101,
        "status": 0,
        "triggerData": 2,
        "eventTriggers": [
          {
            "trigger_data": 2,
            "priority": 101,
            "filters": {
              "key_1": ["value_1"]
            }
          }
        ],
        "triggerTime": 1648665733605,
        "registrant": "android-app://com.registrant.deleteCandidate",
        "aggregatableSourceRegistrationTimeConfig": "INCLUDE"
      },
      {
        "id": "T3",
        "attributionDestination": "https://doNotDelete.site.test",
        "enrollmentId": "enrollment-id",
        "priority": 101,
        "status": 0,
        "triggerData": 2,
        "eventTriggers": [
          {
            "trigger_data": 2,
            "priority": 101,
            "filters": {
              "key_1": ["value_1"]
            }
          }
        ],
        "triggerTime": 1648665733601,
        "registrant": "android-app://com.registrant.deleteCandidate",
        "aggregatableSourceRegistrationTimeConfig": "INCLUDE"
      },
      {
        "id": "T4",
        "attributionDestination": "https://deleteCandidate2.site.test",
        "enrollmentId": "enrollment-id",
        "priority": 101,
        "status": 0,
        "triggerData": 2,
        "eventTriggers": [
          {
            "trigger_data": 2,
            "priority": 101,
            "filters": {
              "key_1": ["value_1"]
            }
          }
        ],
        "triggerTime": 1648665733601,
        "registrant": "android-app://com.registrant.deleteCandidate",
        "aggregatableSourceRegistrationTimeConfig": "INCLUDE"
      },
      {
        "id": "T5",
        "attributionDestination": "https://deletesite1.test",
        "enrollmentId": "enrollment-id",
        "priority": 101,
        "status": 0,
        "triggerData": 2,
        "eventTriggers": [
          {
            "trigger_data": 2,
            "priority": 101,
            "filters": {
              "key_1": ["value_1"]
            }
          }
        ],
        "triggerTime": 1648665733601,
        "registrant": "android-app://com.registrant.deleteCandidate",
        "aggregatableSourceRegistrationTimeConfig": "INCLUDE"
      },
      {
        "id": "Trigger6",
        "attributionDestination": "https://deletesite2.test",
        "enrollmentId": "enrollment-id",
        "priority": 101,
        "status": 0,
        "triggerData": 2,
        "eventTriggers": [
          {
            "trigger_data": 2,
            "priority": 101,
            "filters": {
              "key_1": ["value_1"]
            }
          }
        ],
        "triggerTime": 1648665733601,
        "registrant": "android-app://com.registrant.deleteCandidate",
        "aggregatableSourceRegistrationTimeConfig": "INCLUDE"
      }
    ],
    "event_reports": [
      {
        "id": "E1",
        "sourceEventId": 2,
        "attributionDestination": "https://abc.deletesite1.test",
        "enrollmentId": "enrollment-id",
        "triggerData": 2,
        "triggerTime": 1648665733601,
        "status": 0,
        "reportTime": -1,
        "triggerPriority": 101,
        "sourceType": "navigation",
        "sourceId" : "S1",
        "triggerId" : "T1"
      },
      {
        "id": "E2",
        "sourceEventId": 1,
        "attributionDestination": "android-app://com.site.notInRangeButDeleteDueTosourceEventId1",
        "enrollmentId": "enrollment-id",
        "triggerData": 2,
        "triggerTime": 1648665733605,
        "status": 0,
        "reportTime": -1,
        "triggerPriority": 101,
        "sourceType": "navigation",
        "sourceId" : "S3",
        "triggerId" : "T2"
      },
      {
        "id": "E3",
        "sourceEventId": 2,
        "attributionDestination": "https://doNotDelete.site.test",
        "enrollmentId": "enrollment-id",
        "triggerData": 2,
        "triggerTime": 1648665733601,
        "status": 0,
        "reportTime": -1,
        "triggerPriority": 101,
        "sourceType": "navigation",
        "sourceId" : "S2",
        "triggerId" : "T3"
      },
      {
        "id": "E4",
        "sourceEventId": 2,
        "attributionDestination": "https://deleteCandidate1.site.test",
        "enrollmentId": "enrollment-id",
        "triggerData": 2,
        "triggerTime": 1648665733601,
        "status": 0,
        "reportTime": -1,
        "triggerPriority": 101,
        "sourceType": "navigation",
        "sourceId" : "S2",
        "triggerId" : "T4"
      },
      {
        "id": "E5",
        "sourceEventId": 2,
        "attributionDestination": "https://deleteCandidate1.site.test",
        "enrollmentId": "enrollment-id",
        "triggerData": 2,
        "triggerTime": 1648665733605,
        "status": 0,
        "reportTime": -1,
        "triggerPriority": 101,
        "sourceType": "navigation",
        "sourceId" : "S1",
        "triggerId" : "T2"
      },
      {
        "id": "E6",
        "sourceEventId": 2,
        "attributionDestination": "https://deleteCandidate2.site.test",
        "enrollmentId": "enrollment-id",
        "triggerData": 2,
        "triggerTime": 1648665733601,
        "status": 0,
        "reportTime": -1,
        "triggerPriority": 101,
        "sourceType": "navigation",
        "sourceId" : "S2",
        "triggerId" : "T1"
      },
      {
        "id": "E7",
        "sourceEventId": 2,
        "attributionDestination": "https://qwe.deletesite1.test",
        "enrollmentId": "enrollment-id",
        "triggerData": 2,
        "triggerTime": 1648665733601,
        "status": 0,
        "reportTime": -1,
        "triggerPriority": 101,
        "sourceType": "navigation",
        "sourceId" : "S5",
        "triggerId" : "T5"
      },
      {
        "id": "E8",
        "sourceEventId": 2,
        "attributionDestination": "https://qwe.deletesite2.test",
        "enrollmentId": "enrollment-id",
        "triggerData": 2,
        "triggerTime": 1648665733601,
        "status": 0,
        "reportTime": -1,
        "triggerPriority": 101,
        "sourceType": "navigation",
        "sourceId" : "S4",
        "triggerId" : "Trigger6"
      }
    ],
    "attributions": [
      {
        "id": "A1",
        "sourceSite": "https://site.test",
        "sourceOrigin": "https://deleteCandidate1.site.test",
        "destinationSite": "https://site2.test",
        "destinationOrigin": "https://site2.test",
        "enrollmentId": "enrollment-id",
        "triggerTime": 1648665733601,
        "triggerId": "ignored1648665733601",
        "registrant": "android-app://com.registrant.deleteCandidate",
        "sourceId" : "S3",
        "triggerId" : "T1"
      },
      {
        "id": "A2",
        "sourceSite": "https://site.test",
        "sourceOrigin": "https://deleteCandidate1.site.test",
        "destinationSite": "https://site2.test",
        "destinationOrigin": "https://site2.test",
        "enrollmentId": "enrollment-id",
        "triggerTime": 1648665733605,
        "triggerId": "ignored1648665733605",
        "registrant": "android-app://com.registrant.deleteCandidate",
        "sourceId" : "S2",
        "triggerId" : "T2"
      },
      {
        "id": "A3",
        "sourceSite": "https://site.test",
        "sourceOrigin": "https://deleteCandidate1.site.test",
        "destinationSite": "https://site.test",
        "destinationOrigin": "https://deleteCandidate2.site.test",
        "enrollmentId": "enrollment-id",
        "triggerTime": 1648665733601,
        "triggerId": "ignored1648665733601",
        "registrant": "android-app://com.registrant.deleteCandidate",
        "sourceId" : "S2",
        "triggerId" : "T1"
      },
      {
        "id": "A4",
        "sourceSite": "https://site.test",
        "sourceOrigin": "https://deleteCandidate2.site.test",
        "destinationSite": "https://site2.test",
        "destinationOrigin": "https://site2.test",
        "enrollmentId": "enrollment-id",
        "triggerTime": 1648665733601,
        "triggerId": "ignored1648665733601",
        "registrant": "android-app://com.registrant.deleteCandidate",
        "sourceId" : "S1",
        "triggerId" : "T3"
      },
      {
        "id": "A5",
        "sourceSite": "https://site.test",
        "sourceOrigin": "https://site.test",
        "destinationSite": "https://deletesite2.test",
        "destinationOrigin": "https://abc.deletesite2.test",
        "enrollmentId": "enrollment-id",
        "triggerTime": 1648665733601,
        "triggerId": "ignored1648665733601",
        "registrant": "android-app://com.registrant.deleteCandidate",
        "sourceId" : "S7",
        "triggerId" : "Trigger6"
      },
      {
        "id": "A6",
        "sourceSite": "https://deletesite1.test",
        "sourceOrigin": "https://abc.deletesite1.test",
        "destinationSite": "https://site2.test",
        "destinationOrigin": "https://site2.test",
        "enrollmentId": "enrollment-id",
        "triggerTime": 1648665733601,
        "triggerId": "ignored1648665733601",
        "registrant": "android-app://com.registrant.deleteCandidate",
        "sourceId" : "S3",
        "triggerId" : "Trigger6"
      }
    ]
  },
  "output": {
    "sources": [
      {
        "id": "S1",
        "eventId": 1,
        "sourceType": "navigation",
        "publisher": "https://deleteCandidate1.site.test",
        "enrollmentId": "enrollment-id",
        "eventTime": 1648665733601,
        "expiryTime": 1648665733611,
        "eventReportWindow": 1648665733611,
        "priority": 100,
        "status": 0,
        "registrant": "android-app://com.registrant.deleteCandidate"
      },
      {
        "id": "S2",
        "eventId": 2,
        "sourceType": "navigation",
        "publisher": "https://deleteCandidate1.site.test",
        "enrollmentId": "enrollment-id",
        "eventTime": 1648665733605,
        "expiryTime": 1648665733615,
        "eventReportWindow": 1648665733615,
        "priority": 100,
        "status": 0,
        "registrant": "android-app://com.registrant.deleteCandidate"
      },
      {
        "id": "S4",
        "eventId": 1,
        "sourceType": "navigation",
        "publisher": "https://deleteCandidate2.site.test",
        "enrollmentId": "enrollment-id",
        "eventTime": 1648665733601,
        "expiryTime": 1648665733611,
        "eventReportWindow": 1648665733611,
        "priority": 100,
        "status": 0,
        "registrant": "android-app://com.registrant.deleteCandidate"
      },
      {
        "id": "S5",
        "eventId": 1,
        "sourceType": "navigation",
        "publisher": "https://abc.deletesite1.test",
        "enrollmentId": "enrollment-id",
        "eventTime": 1648665733601,
        "expiryTime": 1648665733611,
        "eventReportWindow": 1648665733611,
        "priority": 100,
        "status": 0,
        "registrant": "android-app://com.registrant.deleteCandidate"
      },
      {
        "id": "S6",
        "eventId": 1,
        "sourceType": "navigation",
        "publisher": "https://abc.deletesite2.test",
        "enrollmentId": "enrollment-id",
        "eventTime": 1648665733601,
        "expiryTime": 1648665733611,
        "eventReportWindow": 1648665733611,
        "priority": 100,
        "status": 0,
        "registrant": "android-app://com.registrant.deleteCandidate"
      }
    ],
    "source_destinations": [
      {
        "sourceId": "S1",
        "destination": "android-app://com.app2",
        "destinationType": 0
      },
      {
        "sourceId": "S2",
        "destination": "android-app://com.app2",
        "destinationType": 0
      },
      {
        "sourceId": "S4",
        "destination": "android-app://com.app2",
        "destinationType": 0
      },
      {
        "sourceId": "S5",
        "destination": "android-app://com.app2",
        "destinationType": 0
      },
      {
        "sourceId": "S6",
        "destination": "android-app://com.app2",
        "destinationType": 0
      }
    ],
    "triggers": [
      {
        "id": "T1",
        "attributionDestination": "https://deleteCandidate1.site.test",
        "enrollmentId": "enrollment-id",
        "priority": 101,
        "status": 0,
        "triggerData": 2,
        "eventTriggers": [
          {
            "trigger_data": 2,
            "priority": 101,
            "filters": {
              "key_1": ["value_1"]
            }
          }
        ],
        "triggerTime": 1648665733601,
        "registrant": "android-app://com.registrant.deleteCandidate",
        "aggregatableSourceRegistrationTimeConfig": "INCLUDE"
      },
      {
        "id": "T2",
        "attributionDestination": "https://deleteCandidate1.site.test",
        "enrollmentId": "enrollment-id",
        "priority": 101,
        "status": 0,
        "triggerData": 2,
        "eventTriggers": [
          {
            "trigger_data": 2,
            "priority": 101,
            "filters": {
              "key_1": ["value_1"]
            }
          }
        ],
        "triggerTime": 1648665733605,
        "registrant": "android-app://com.registrant.deleteCandidate",
        "aggregatableSourceRegistrationTimeConfig": "INCLUDE"
      },
      {
        "id": "T4",
        "attributionDestination": "https://deleteCandidate2.site.test",
        "enrollmentId": "enrollment-id",
        "priority": 101,
        "status": 0,
        "triggerData": 2,
        "eventTriggers": [
          {
            "trigger_data": 2,
            "priority": 101,
            "filters": {
              "key_1": ["value_1"]
            }
          }
        ],
        "triggerTime": 1648665733601,
        "registrant": "android-app://com.registrant.deleteCandidate",
        "aggregatableSourceRegistrationTimeConfig": "INCLUDE"
      },
      {
        "id": "T5",
        "attributionDestination": "https://deletesite1.test",
        "enrollmentId": "enrollment-id",
        "priority": 101,
        "status": 0,
        "triggerData": 2,
        "eventTriggers": [
          {
            "trigger_data": 2,
            "priority": 101,
            "filters": {
              "key_1": ["value_1"]
            }
          }
        ],
        "triggerTime": 1648665733601,
        "registrant": "android-app://com.registrant.deleteCandidate",
        "aggregatableSourceRegistrationTimeConfig": "INCLUDE"
      },
      {
        "id": "Trigger6",
        "attributionDestination": "https://deletesite2.test",
        "enrollmentId": "enrollment-id",
        "priority": 101,
        "status": 0,
        "triggerData": 2,
        "eventTriggers": [
          {
            "trigger_data": 2,
            "priority": 101,
            "filters": {
              "key_1": ["value_1"]
            }
          }
        ],
        "triggerTime": 1648665733601,
        "registrant": "android-app://com.registrant.deleteCandidate",
        "aggregatableSourceRegistrationTimeConfig": "INCLUDE"
      }
    ],
    "event_reports": [
      {
        "id": "E1",
        "sourceEventId": 2,
        "attributionDestination": "https://abc.deletesite1.test",
        "enrollmentId": "enrollment-id",
        "triggerData": 2,
        "triggerTime": 1648665733601,
        "status": 0,
        "reportTime": -1,
        "triggerPriority": 101,
        "sourceType": "navigation",
        "sourceId" : "S1",
        "triggerId" : "T1"
      },
      {
        "id": "E4",
        "sourceEventId": 2,
        "attributionDestination": "https://deleteCandidate1.site.test",
        "enrollmentId": "enrollment-id",
        "triggerData": 2,
        "triggerTime": 1648665733601,
        "status": 0,
        "reportTime": -1,
        "triggerPriority": 101,
        "sourceType": "navigation",
        "sourceId" : "S2",
        "triggerId" : "T4"
      },
      {
        "id": "E5",
        "sourceEventId": 2,
        "attributionDestination": "https://deleteCandidate1.site.test",
        "enrollmentId": "enrollment-id",
        "triggerData": 2,
        "triggerTime": 1648665733605,
        "status": 0,
        "reportTime": -1,
        "triggerPriority": 101,
        "sourceType": "navigation",
        "sourceId" : "S1",
        "triggerId" : "T2"
      },
      {
        "id": "E6",
        "sourceEventId": 2,
        "attributionDestination": "https://deleteCandidate2.site.test",
        "enrollmentId": "enrollment-id",
        "triggerData": 2,
        "triggerTime": 1648665733601,
        "status": 0,
        "reportTime": -1,
        "triggerPriority": 101,
        "sourceType": "navigation",
        "sourceId" : "S2",
        "triggerId" : "T1"
      },
      {
        "id": "E7",
        "sourceEventId": 2,
        "attributionDestination": "https://qwe.deletesite1.test",
        "enrollmentId": "enrollment-id",
        "triggerData": 2,
        "triggerTime": 1648665733601,
        "status": 0,
        "reportTime": -1,
        "triggerPriority": 101,
        "sourceType": "navigation",
        "sourceId" : "S5",
        "triggerId" : "T5"
      },
      {
        "id": "E8",
        "sourceEventId": 2,
        "attributionDestination": "https://qwe.deletesite2.test",
        "enrollmentId": "enrollment-id",
        "triggerData": 2,
        "triggerTime": 1648665733601,
        "status": 0,
        "reportTime": -1,
        "triggerPriority": 101,
        "sourceType": "navigation",
        "sourceId" : "S4",
        "triggerId" : "Trigger6"
      }
    ],
    "attributions": [
      {
        "id": "A2",
        "sourceSite": "https://site.test",
        "sourceOrigin": "https://deleteCandidate1.site.test",
        "destinationSite": "https://site2.test",
        "destinationOrigin": "https://site2.test",
        "enrollmentId": "enrollment-id",
        "triggerTime": 1648665733605,
        "triggerId": "ignored1648665733605",
        "registrant": "android-app://com.registrant.deleteCandidate",
        "sourceId" : "S2",
        "triggerId" : "T2"
      },
      {
        "id": "A3",
        "sourceSite": "https://site.test",
        "sourceOrigin": "https://deleteCandidate1.site.test",
        "destinationSite": "https://site.test",
        "destinationOrigin": "https://deleteCandidate2.site.test",
        "enrollmentId": "enrollment-id",
        "triggerTime": 1648665733601,
        "triggerId": "ignored1648665733601",
        "registrant": "android-app://com.registrant.deleteCandidate",
        "sourceId" : "S2",
        "triggerId" : "T1"
      }
    ]
  },
  "param": {
    "registrant": "com.registrant.deleteCandidate",
    "start": 1648665733600,
    "end": 1648665733602,
    "origins": ["https://deleteCandidate1.site.test", "https://deleteCandidate2.site.test"],
    "domains": ["https://deletesite1.test", "https://deletesite2.test"],
    "deletionMode": 0,
    "matchBehavior": 1
  }
}