{
  "description": "One web source and one web trigger that match. Event report task within the expiry window sends one report.",
  "input": {
    "web_sources": [{
      "registration_request": {
        "source_origin": "android-app://example.1s1.test",
        "source_type": "navigation",
        "web_destination": "https://example.2d1.test",
        "registrant": "example.1s1.test",
        "source_params": [{
          "attribution_src_url": "https://www.ad-tech1.test"
        }]
      },
      "responses": [{
        "url": "https://www.ad-tech1.test",
        "debug_permission":  false,
        "response": {
          "Attribution-Reporting-Register-Source": {
            "source_event_id": "1",
            "web_destination": "https://example.2d1.test",
            "priority": "100",
            "expiry": "172801"
          },
          "Location": null,
          "Attribution-Reporting-Redirect": null
        }
      }],
      "timestamp": "800000000001"
    }],
    "web_triggers": [{
      "registration_request": {
        "destination_origin": "https://example.2d1.test",
        "registrant": "example.2d1.test",
        "trigger_params": [{
          "attribution_src_url": "https://www.ad-tech1.test"
        }]
      },
      "responses": [{
        "url": "https://www.ad-tech1.test",
        "debug_permission":  false,
        "response": {
          "Attribution-Reporting-Register-Trigger": {
            "event_trigger_data": [
              {
                "trigger_data": "2",
                "priority": "101"
              }
            ]
          },
          "Location": null,
          "Attribution-Reporting-Redirect": null
        }
      }],
      "timestamp": "800000600001"
    }]
  },
  "output": {
    "event_level_results": [{
      "report_time": "800172800001",
      "report_url": "https://www.ad-tech1.test/.well-known/attribution-reporting/report-event-attribution",
      "payload": {
        "attribution_destination": "https://2d1.test",
        "scheduled_report_time": "800172800",
        "source_event_id": "1",
        "trigger_data": "2",
        "source_type": "navigation",
        "randomized_trigger_rate": 0.0008051
      }
    }],
    "aggregatable_results": []
  }
}
