{
  "name": "With multiple origin and no domain",
  "description": "(S1,S4), (T1, T4), (E1,E2, E4, E6), (A1,A4), and (AR1) will be deleted due to origin match. S2,T2,E5,A2,AR2 skipped as they are out of time range.",
  "input": {
    "sources": [
      {
        "id": "S1",
        "eventId": 1,
        "sourceType": "navigation",
        "publisher": "https://deleteCandidate1.site.test",
        "enrollmentId": "enrollment-id",
        "eventTime": 1648665733601,
        "expiryTime": 1648665733611,
        "eventReportWindow": 1648665733611,
        "priority": 100,
        "status": 0,
        "registrant": "android-app://com.registrant.deleteCandidate"
      },
      {
        "id": "S2",
        "eventId": 2,
        "sourceType": "navigation",
        "publisher": "https://deleteCandidate1.site.test",
        "enrollmentId": "enrollment-id",
        "eventTime": 1648665733605,
        "expiryTime": 1648665733615,
        "eventReportWindow": 1648665733615,
        "priority": 100,
        "status": 0,
        "registrant": "android-app://com.registrant.deleteCandidate"
      },
      {
        "id": "S3",
        "eventId": 3,
        "sourceType": "navigation",
        "publisher": "https://siteNotMatch.site3.test",
        "enrollmentId": "enrollment-id",
        "eventTime": 1648665733601,
        "expiryTime": 1648665733611,
        "eventReportWindow": 1648665733611,
        "priority": 100,
        "status": 0,
        "registrant": "android-app://com.registrant.deleteCandidate"
      },
      {
        "id": "S4",
        "eventId": 1,
        "sourceType": "navigation",
        "publisher": "https://deleteCandidate2.site.test",
        "enrollmentId": "enrollment-id",
        "eventTime": 1648665733601,
        "expiryTime": 1648665733611,
        "eventReportWindow": 1648665733611,
        "priority": 100,
        "status": 0,
        "registrant": "android-app://com.registrant.deleteCandidate"
      }
    ],
    "source_destinations": [
      {
        "sourceId": "S1",
        "destination": "android-app://com.site2",
        "destinationType": 0
      },
      {
        "sourceId": "S2",
        "destination": "android-app://com.site2",
        "destinationType": 0
      },
      {
        "sourceId": "S3",
        "destination": "android-app://com.site2",
        "destinationType": 0
      },
      {
        "sourceId": "S4",
        "destination": "android-app://com.site2",
        "destinationType": 0
      }
    ],
    "triggers": [
      {
        "id": "T1",
        "attributionDestination": "https://deleteCandidate1.site.test",
        "enrollmentId": "enrollment-id",
        "priority": 101,
        "status": 0,
        "triggerData": 2,
        "eventTriggers": [
          {
            "trigger_data": 2,
            "priority": 101,
            "filters": {
              "key_1": ["value_1"]
            }
          }
        ],
        "triggerTime": 1648665733601,
        "registrant": "android-app://com.registrant.deleteCandidate",
        "aggregatableSourceRegistrationTimeConfig": "INCLUDE"
      },
      {
        "id": "T2",
        "attributionDestination": "https://deleteCandidate1.site.test",
        "enrollmentId": "enrollment-id",
        "priority": 101,
        "status": 0,
        "triggerData": 2,
        "eventTriggers": [
          {
            "trigger_data": 2,
            "priority": 101,
            "filters": {
              "key_1": ["value_1"]
            }
          }
        ],
        "triggerTime": 1648665733605,
        "registrant": "android-app://com.registrant.deleteCandidate",
        "aggregatableSourceRegistrationTimeConfig": "INCLUDE"
      },
      {
        "id": "T3",
        "attributionDestination": "https://doNotDelete.site.test",
        "enrollmentId": "enrollment-id",
        "priority": 101,
        "status": 0,
        "triggerData": 2,
        "eventTriggers": [
          {
            "trigger_data": 2,
            "priority": 101,
            "filters": {
              "key_1": ["value_1"]
            }
          }
        ],
        "triggerTime": 1648665733601,
        "registrant": "android-app://com.registrant.deleteCandidate",
        "aggregatableSourceRegistrationTimeConfig": "INCLUDE"
      },
      {
        "id": "T4",
        "attributionDestination": "https://deleteCandidate2.site.test",
        "enrollmentId": "enrollment-id",
        "priority": 101,
        "status": 0,
        "triggerData": 2,
        "eventTriggers": [
          {
            "trigger_data": 2,
            "priority": 101,
            "filters": {
              "key_1": ["value_1"]
            }
          }
        ],
        "triggerTime": 1648665733601,
        "registrant": "android-app://com.registrant.deleteCandidate",
        "aggregatableSourceRegistrationTimeConfig": "INCLUDE"
      }
    ],
    "event_reports": [
      {
        "id": "E1",
        "sourceEventId": 1,
        "attributionDestination": "https://deleteCandidate1.site.test",
        "enrollmentId": "enrollment-id",
        "triggerData": 2,
        "triggerTime": 1648665733601,
        "status": 0,
        "reportTime": -1,
        "triggerPriority": 101,
        "sourceType": "navigation",
        "sourceId": "S1",
        "triggerId": "T1"
      },
      {
        "id": "E2",
        "sourceEventId": 1,
        "attributionDestination": "android-app://com.site.notInRangeButDeleteDueToSourceId1",
        "enrollmentId": "enrollment-id",
        "triggerData": 2,
        "triggerTime": 1648665733605,
        "status": 0,
        "reportTime": -1,
        "triggerPriority": 101,
        "sourceType": "navigation",
        "sourceId": "S1",
        "triggerId": "T2"
      },
      {
        "id": "E3",
        "sourceEventId": 2,
        "attributionDestination": "https://doNotDelete.site.test",
        "enrollmentId": "enrollment-id",
        "triggerData": 2,
        "triggerTime": 1648665733601,
        "status": 0,
        "reportTime": -1,
        "triggerPriority": 101,
        "sourceType": "navigation",
        "sourceId": "S3",
        "triggerId": "T3"
      },
      {
        "id": "E4",
        "sourceEventId": 2,
        "attributionDestination": "https://deleteCandidate1.site.test",
        "enrollmentId": "enrollment-id",
        "triggerData": 2,
        "triggerTime": 1648665733601,
        "status": 0,
        "reportTime": -1,
        "triggerPriority": 101,
        "sourceType": "navigation",
        "sourceId": "S1",
        "triggerId": "T1"
      },
      {
        "id": "E5",
        "sourceEventId": 2,
        "attributionDestination": "https://deleteCandidate1.site.test",
        "enrollmentId": "enrollment-id",
        "triggerData": 2,
        "triggerTime": 1648665733605,
        "status": 0,
        "reportTime": -1,
        "triggerPriority": 101,
        "sourceType": "navigation",
        "sourceId": "S3",
        "triggerId": "T3"
      },
      {
        "id": "E6",
        "sourceEventId": 2,
        "attributionDestination": "https://deleteCandidate2.site.test",
        "enrollmentId": "enrollment-id",
        "triggerData": 2,
        "triggerTime": 1648665733601,
        "status": 0,
        "reportTime": -1,
        "triggerPriority": 101,
        "sourceType": "navigation",
        "sourceId": "S3",
        "triggerId": "T4"
      }
    ],
    "attributions": [
      {
        "id": "A1",
        "sourceSite": "https://site.test",
        "sourceOrigin": "https://deleteCandidate1.site.test",
        "destinationSite": "https://site2.test",
        "destinationOrigin": "https://site2.test",
        "enrollmentId": "enrollment-id",
        "triggerTime": 1648665733601,
        "triggerId": "ignored1648665733601",
        "registrant": "android-app://com.registrant.deleteCandidate",
        "sourceId": "S1",
        "triggerId": "T1"
      },
      {
        "id": "A2",
        "sourceSite": "https://site.test",
        "sourceOrigin": "https://deleteCandidate1.site.test",
        "destinationSite": "https://site2.test",
        "destinationOrigin": "https://site2.test",
        "enrollmentId": "enrollment-id",
        "triggerTime": 1648665733605,
        "triggerId": "ignored1648665733605",
        "registrant": "android-app://com.registrant.deleteCandidate",
        "sourceId": "S2",
        "triggerId": "T3"
      },
      {
        "id": "A3",
        "sourceSite": "https://site3.test",
        "sourceOrigin": "https://site3.test",
        "destinationSite": "https://site2.test",
        "destinationOrigin": "https://site2.test",
        "enrollmentId": "enrollment-id",
        "triggerTime": 1648665733601,
        "triggerId": "ignored1648665733601",
        "registrant": "android-app://com.registrant.deleteCandidate",
        "sourceId": "S3",
        "triggerId": "T3"
      },
      {
        "id": "A4",
        "sourceSite": "https://site.test",
        "sourceOrigin": "https://deleteCandidate2.site.test",
        "destinationSite": "https://site2.test",
        "destinationOrigin": "https://site2.test",
        "enrollmentId": "enrollment-id",
        "triggerTime": 1648665733601,
        "triggerId": "ignored1648665733601",
        "registrant": "android-app://com.registrant.deleteCandidate",
        "sourceId": "S2",
        "triggerId": "T4"
      }
    ],
    "async_registrations": [
      {
        "registrationId": "AR1",
        "registrationUri": "https://foo.com",
        "topOrigin": "https://deleteCandidate1.site.test",
        "registrant": "android-app://com.registrant.deleteCandidate",
        "osDestination": "https://foo.com",
        "requestTime": 1648665733601,
        "adIdPermission": false,
        "id": "id1",
        "registrationType": 0,
        "platformAdId": "platform",
        "debugKeyAllowed": false,
        "retryCount": 1,
        "verifiedDestination": "https://foo.com",
        "webDestination": "https://foo.com",
        "sourceType": 1,
        "redirectBehavior": "AS_IS"
      },
      {
        "registrationId": "AR2",
        "registrationUri": "https://foo.com",
        "topOrigin": "https://deleteCandidate2.site.test",
        "registrant": "android-app://com.registrant.deleteCandidate",
        "osDestination": "https://foo.com",
        "requestTime": 1648665733605,
        "adIdPermission": false,
        "id": "id2",
        "registrationType": 0,
        "platformAdId": "platform",
        "debugKeyAllowed": false,
        "retryCount": 1,
        "verifiedDestination": "https://foo.com",
        "webDestination": "https://foo.com",
        "sourceType": 1,
        "redirectBehavior": "AS_IS"
      }
    ]
  },
  "output": {
    "sources": [
      {
        "id": "S2",
        "eventId": 2,
        "sourceType": "navigation",
        "publisher": "https://deleteCandidate1.site.test",
        "enrollmentId": "enrollment-id",
        "eventTime": 1648665733605,
        "expiryTime": 1648665733615,
        "eventReportWindow": 1648665733615,
        "priority": 100,
        "status": 0,
        "registrant": "android-app://com.registrant.deleteCandidate"
      },
      {
        "id": "S3",
        "eventId": 3,
        "sourceType": "navigation",
        "publisher": "https://siteNotMatch.site3.test",
        "enrollmentId": "enrollment-id",
        "eventTime": 1648665733601,
        "expiryTime": 1648665733611,
        "eventReportWindow": 1648665733611,
        "priority": 100,
        "status": 0,
        "registrant": "android-app://com.registrant.deleteCandidate"
      }
    ],
    "source_destinations": [
      {
        "sourceId": "S2",
        "destination": "android-app://com.site2",
        "destinationType": 0
      },
      {
        "sourceId": "S3",
        "destination": "android-app://com.site2",
        "destinationType": 0
      }
    ],
    "triggers": [
      {
        "id": "T2",
        "attributionDestination": "https://deleteCandidate1.site.test",
        "enrollmentId": "enrollment-id",
        "priority": 101,
        "status": 0,
        "triggerData": 2,
        "eventTriggers": [
          {
            "trigger_data": 2,
            "priority": 101,
            "filters": {
              "key_1": ["value_1"]
            }
          }
        ],
        "triggerTime": 1648665733605,
        "registrant": "android-app://com.registrant.deleteCandidate",
        "aggregatableSourceRegistrationTimeConfig": "INCLUDE"
      },
      {
        "id": "T3",
        "attributionDestination": "https://doNotDelete.site.test",
        "enrollmentId": "enrollment-id",
        "priority": 101,
        "status": 0,
        "triggerData": 2,
        "eventTriggers": [
          {
            "trigger_data": 2,
            "priority": 101,
            "filters": {
              "key_1": ["value_1"]
            }
          }
        ],
        "triggerTime": 1648665733601,
        "registrant": "android-app://com.registrant.deleteCandidate",
        "aggregatableSourceRegistrationTimeConfig": "INCLUDE"
      }
    ],
    "event_reports": [
      {
        "id": "E3",
        "sourceEventId": 2,
        "attributionDestination": "https://doNotDelete.site.test",
        "enrollmentId": "enrollment-id",
        "triggerData": 2,
        "triggerTime": 1648665733601,
        "status": 0,
        "reportTime": -1,
        "triggerPriority": 101,
        "sourceType": "navigation",
        "sourceId": "S3",
        "triggerId": "T3"
      },
      {
        "id": "E5",
        "sourceEventId": 2,
        "attributionDestination": "https://deleteCandidate1.site.test",
        "enrollmentId": "enrollment-id",
        "triggerData": 2,
        "triggerTime": 1648665733605,
        "status": 0,
        "reportTime": -1,
        "triggerPriority": 101,
        "sourceType": "navigation",
        "sourceId": "S3",
        "triggerId": "T3"
      }
    ],
    "attributions": [
      {
        "id": "A2",
        "sourceSite": "https://site.test",
        "sourceOrigin": "https://deleteCandidate1.site.test",
        "destinationSite": "https://site2.test",
        "destinationOrigin": "https://site2.test",
        "enrollmentId": "enrollment-id",
        "triggerTime": 1648665733605,
        "triggerId": "ignored1648665733605",
        "registrant": "android-app://com.registrant.deleteCandidate",
        "sourceId": "S2",
        "triggerId": "T3"
      },
      {
        "id": "A3",
        "sourceSite": "https://site3.test",
        "sourceOrigin": "https://site3.test",
        "destinationSite": "https://site2.test",
        "destinationOrigin": "https://site2.test",
        "enrollmentId": "enrollment-id",
        "triggerTime": 1648665733601,
        "triggerId": "ignored1648665733601",
        "registrant": "android-app://com.registrant.deleteCandidate",
        "sourceId": "S3",
        "triggerId": "T3"
      }
    ],
    "async_registrations": [
      {
        "registrationId": "AR2",
        "registrationUri": "https://foo.com",
        "topOrigin": "https://deleteCandidate2.site.test",
        "registrant": "android-app://com.registrant.deleteCandidate",
        "osDestination": "https://foo.com",
        "requestTime": 1648665733605,
        "adIdPermission": false,
        "id": "id2",
        "registrationType": 0,
        "platformAdId": "platform",
        "debugKeyAllowed": false,
        "retryCount": 1,
        "verifiedDestination": "https://foo.com",
        "webDestination": "https://foo.com",
        "sourceType": 1,
        "redirectBehavior": "AS_IS"
      }
    ]
  },
  "param": {
    "registrant": "com.registrant.deleteCandidate",
    "start": 1648665733600,
    "end": 1648665733602,
    "origins": ["https://deleteCandidate1.site.test", "https://deleteCandidate2.site.test"],
    "domains": []
  }
}