{
  "description": "A2A: given two sources when max_sources_per_origin is set to 1, has_ad_id_permission is enabled. Can generate event report. Expected source-storage-limit additional debug report",
  "phflags_override": {
    "measurement_max_sources_per_publisher": "1"
  },
  "input": {
    "sources": [
      {
        "registration_request": {
          "source_type": "navigation",
          "registrant": "example.1s1.test"
        },
        "responses": [{
          "url": "https://www.ad-tech1.test",
          "has_ad_id_permission": true,
          "response": {
            "Attribution-Reporting-Register-Source": {
              "source_event_id": "1",
              "destination": "android-app://example.2d1.test",
              "priority": "100",
              "expiry": "172801",
              "debug_key": "347982378",
              "debug_reporting": true
            },
            "Location": null,
            "Attribution-Reporting-Redirect": null
          }
        }],
        "timestamp": "800000000001"
      },
      {
        "registration_request": {
          "source_type": "navigation",
          "registrant": "example.1s1.test"
        },
        "responses": [{
          "url": "https://www.ad-tech1.test",
          "has_ad_id_permission": true,
          "response": {
            "Attribution-Reporting-Register-Source": {
              "source_event_id": "1",
              "destination": "android-app://example.2d1.test",
              "priority": "100",
              "expiry": "172801",
              "debug_key": "347982379",
              "debug_reporting": true
            },
            "Location": null,
            "Attribution-Reporting-Redirect": null
          }
        }],
        "timestamp": "800000000001"
      }],
    "triggers": [{
      "registration_request": {
        "registrant": "example.2d1.test"
      },
      "responses": [{
        "url": "https://www.ad-tech1.test",
        "has_ad_id_permission": true,
        "response": {
          "Attribution-Reporting-Register-Trigger": {
            "event_trigger_data": [
              {
                "trigger_data": "2",
                "priority": "101"
              }
            ],
            "debug_key": "147982378"
          },
          "Location": null,
          "Attribution-Reporting-Redirect": null
        }
      }],
      "timestamp": "800000000002"
    }]
  },
  "output": {
    "event_level_results": [{
      "report_time": "800172800001",
      "report_url": "https://www.ad-tech1.test/.well-known/attribution-reporting/report-event-attribution",
      "payload": {
        "attribution_destination": "android-app://example.2d1.test",
        "scheduled_report_time": "800172800",
        "source_event_id": "1",
        "trigger_data": "2",
        "source_type": "navigation",
        "randomized_trigger_rate": 0.0008051,
        "source_debug_key": "347982378",
        "trigger_debug_key": "147982378"
      }
    }],
    "debug_event_level_results": [{
      "report_time": "800000000002",
      "report_url": "https://www.ad-tech1.test/.well-known/attribution-reporting/debug/report-event-attribution",
      "payload": {
        "attribution_destination": "android-app://example.2d1.test",
        "scheduled_report_time": "800172800",
        "source_event_id": "1",
        "trigger_data": "2",
        "source_type": "navigation",
        "randomized_trigger_rate": 0.0008051,
        "source_debug_key": "347982378",
        "trigger_debug_key": "147982378"
      }
    }],
    "verbose_debug_reports": [
      {
        "report_time": "800000000001",
        "report_url": "https://www.ad-tech1.test/.well-known/attribution-reporting/debug/verbose",
        "payload": [
          {
            "type": "source-success",
            "body": {
              "source_event_id": "1",
              "attribution_destination": "android-app://example.2d1.test",
              "source_site": "android-app://example.1s1.test",
              "source_debug_key": "347982378"
            }
          }
        ]
      },
      {
        "report_time": "800000000001",
        "report_url": "https://www.ad-tech1.test/.well-known/attribution-reporting/debug/verbose",
        "payload": [
          {
            "type": "source-storage-limit",
            "body": {
              "source_event_id": "1",
              "attribution_destination": "android-app://example.2d1.test",
              "source_site": "android-app://example.1s1.test",
              "limit": "1",
              "source_debug_key": "347982379"
            }
          }
        ]
      }
    ]
  }
}
