[
  {
    "name": "winningCA",
    "buyer": "ba-buyer-5jyy5ulagq-uc.a.run.app",
    "activationTime": "2022-12-20T15:48:08.688Z",
    "expirationTime": "2022-12-20T16:03:08.688Z",
    "dailyUpdateUri": "https://ba-buyer-5jyy5ulagq-uc.a.run.app/update",
    "biddingLogicUri": "https://ba-buyer-5jyy5ulagq-uc.a.run.app/rb/bjs",
    "userBiddingSignals": {
      "signals": []
    },
    "trustedBiddingData": {
      "trustedBiddingKeys": [
        "1j7245936676"
      ],
      "trustedBiddingUri": "https://ba-buyer-5jyy5ulagq-uc.a.run.app/rb/bts"
    },
    "ads": [
      {
        "ad_render_id" : "1a",
        "render_uri": "https://ba-buyer-5jyy5ulagq-uc.a.run.app/1a",
        "metadata": {
          "metadata": [
            "123394967410",
            "618898865445",
            "1",
            "14898603099"
          ]
        }
      }
    ]
  }
]