{
  "description": "One source followed by three triggers and no competition",
  "phflags_override": {
    "measurement_flexible_event_reporting_api_enabled": "true"
  },
  "input": {
    "sources": [
      {
        "registration_request": {
          "source_type": "navigation",
          "registrant": "example.1s1.test"
        },
        "responses": [
          {
            "url": "https://www.ad-tech1.test",
            "response": {
              "Attribution-Reporting-Register-Source": {
                "source_event_id": "2",
                "destination": "android-app://example.2d1.test",
                "priority": "20",
                "expiry": "172801",
                "event_report_windows": {
                  "start_time": 0,
                  "end_times": [172800]
                },
                "trigger_data": [0, 1, 2, 3],
                "max_event_level_reports": 3
              },
              "Location": null,
              "Attribution-Reporting-Redirect": null
            }
          }
        ],
        "timestamp": "800000600001"
      }
    ],
    "triggers": [
      {
        "registration_request": {
          "registrant": "example.2d1.test"
        },
        "responses": [
          {
            "url": "https://www.ad-tech1.test",
            "response": {
              "Attribution-Reporting-Register-Trigger": {
                "event_trigger_data": [
                  {
                    "trigger_data": "1",
                    "priority": "100",
                    "deduplication_key": "10"
                  }
                ]
              },
              "Location": null,
              "Attribution-Reporting-Redirect": null
            }
          }
        ],
        "timestamp": "800001800001"
      },
      {
        "registration_request": {
          "registrant": "example.2d1.test"
        },
        "responses": [
          {
            "url": "https://www.ad-tech1.test",
            "response": {
              "Attribution-Reporting-Register-Trigger": {
                "event_trigger_data": [
                  {
                    "trigger_data": "2",
                    "priority": "101",
                    "deduplication_key": "11"
                  }
                ]
              },
              "Location": null,
              "Attribution-Reporting-Redirect": null
            }
          }
        ],
        "timestamp": "800002400001"
      },
      {
        "registration_request": {
          "registrant": "example.2d1.test"
        },
        "responses": [
          {
            "url": "https://www.ad-tech1.test",
            "response": {
              "Attribution-Reporting-Register-Trigger": {
                "event_trigger_data": [
                  {
                    "trigger_data": "0",
                    "priority": "200",
                    "deduplication_key": "9"
                  }
                ]
              },
              "Location": null,
              "Attribution-Reporting-Redirect": null
            }
          }
        ],
        "timestamp": "800003000001"
      }
    ]
  },
  "output": {
    "event_level_results": [
      {
        "report_time": "800173400001",
        "report_url": "https://www.ad-tech1.test/.well-known/attribution-reporting/report-event-attribution",
        "payload": {
          "attribution_destination": "android-app://example.2d1.test",
          "scheduled_report_time": "800173400",
          "source_event_id": "2",
          "trigger_data": "2",
          "source_type": "navigation",
          "trigger_summary_bucket": [1, 1],
          "randomized_trigger_rate": 0.0000291
        }
      },
      {
        "report_time": "800173400001",
        "report_url": "https://www.ad-tech1.test/.well-known/attribution-reporting/report-event-attribution",
        "payload": {
          "attribution_destination": "android-app://example.2d1.test",
          "scheduled_report_time": "800173400",
          "source_event_id": "2",
          "trigger_data": "1",
          "source_type": "navigation",
          "trigger_summary_bucket": [1, 1],
          "randomized_trigger_rate": 0.0000291
        }
      },
      {
        "report_time": "800173400001",
        "report_url": "https://www.ad-tech1.test/.well-known/attribution-reporting/report-event-attribution",
        "payload": {
          "attribution_destination": "android-app://example.2d1.test",
          "scheduled_report_time": "800173400",
          "source_event_id": "2",
          "trigger_data": "0",
          "source_type": "navigation",
          "trigger_summary_bucket": "[1,1]",
          "randomized_trigger_rate": 0.0000291
        }
      }
    ],
    "aggregatable_results": []
  }
}