[
  {
    "cmds": [
      {
        "cmd": {
          "args": [
            "../../usr/bin/clang",
            "--sysroot=/usr/x86_64-cros-linux-gnu",
            "-Qunused-arguments",
            "-Werror=poison-system-directories",
            "-Wno-deprecated-declarations",
            "-Wno-enum-constexpr-conversion",
            "-Wno-error=implicit-function-declaration",
            "-Wno-error=implicit-int",
            "-Wno-final-dtor-non-final-class",
            "-Wno-single-bit-bitfield-constant-conversion",
            "-Wno-tautological-constant-compare",
            "-Wno-tautological-unsigned-enum-zero-compare",
            "-Wno-unknown-warning-option",
            "-fdebug-default-version=5",
            "-Wno-int-conversion",
            "-Wno-incompatible-function-pointer-types",
            "-Wno-error=vla-cxx-extension",
            "-D_LIBCPP_ENABLE_CXX17_REMOVED_FEATURES",
            "-fclang-abi-compat=17",
            "-Wno-section",
            "-static-libgcc",
            "--prefix=../../bin/x86_64-cros-linux-gnu-",
            "-mno-movbe",
            "-Wclobbered",
            "-Wno-psabi",
            "-Wlogical-op",
            "-Wmissing-parameter-type",
            "-Wold-style-declaration",
            "-Woverride-init",
            "-Wunsafe-loop-optimizations",
            "main.cc",
            "-L/usr/x86_64-cros-linux-gnu/usr/lib64",
            "-mno-movbe",
            "-B../../bin",
            "-target",
            "x86_64-cros-linux-gnu"
          ],
          "env_updates": [
            "CCACHE_DIR=/var/cache/distfiles/ccache",
            "CCACHE_UMASK=002",
            "CCACHE_CPP2=yes"
          ],
          "path": "/usr/bin/ccache"
        }
      }
    ],
    "wd": "/tmp/stable",
    "wrapper": {
      "cmd": {
        "args": [
          "-mno-movbe",
          "-Wclobbered",
          "-Wno-psabi",
          "-Wlogical-op",
          "-Wmissing-parameter-type",
          "-Wold-style-declaration",
          "-Woverride-init",
          "-Wunsafe-loop-optimizations",
          "-Wstrict-aliasing=abc",
          "-finline-limit=abc",
          "main.cc"
        ],
        "path": "./x86_64-cros-linux-gnu-clang"
      }
    }
  },
  {
    "cmds": [
      {
        "cmd": {
          "args": [
            "../../usr/bin/clang",
            "--sysroot=/usr/x86_64-cros-linux-gnu",
            "-Qunused-arguments",
            "-Werror=poison-system-directories",
            "-Wno-deprecated-declarations",
            "-Wno-enum-constexpr-conversion",
            "-Wno-error=implicit-function-declaration",
            "-Wno-error=implicit-int",
            "-Wno-final-dtor-non-final-class",
            "-Wno-single-bit-bitfield-constant-conversion",
            "-Wno-tautological-constant-compare",
            "-Wno-tautological-unsigned-enum-zero-compare",
            "-Wno-unknown-warning-option",
            "-fdebug-default-version=5",
            "-Wno-int-conversion",
            "-Wno-incompatible-function-pointer-types",
            "-Wno-error=vla-cxx-extension",
            "-D_LIBCPP_ENABLE_CXX17_REMOVED_FEATURES",
            "-fclang-abi-compat=17",
            "-Wno-section",
            "-static-libgcc",
            "--prefix=../../bin/x86_64-cros-linux-gnu-",
            "-Wno-#warnings",
            "main.cc",
            "-L/usr/x86_64-cros-linux-gnu/usr/lib64",
            "-mno-movbe",
            "-B../../bin",
            "-target",
            "x86_64-cros-linux-gnu"
          ],
          "env_updates": [
            "CCACHE_DIR=/var/cache/distfiles/ccache",
            "CCACHE_UMASK=002",
            "CCACHE_CPP2=yes"
          ],
          "path": "/usr/bin/ccache"
        }
      }
    ],
    "wd": "/tmp/stable",
    "wrapper": {
      "cmd": {
        "args": [
          "-Wno-error=cpp",
          "main.cc"
        ],
        "path": "./x86_64-cros-linux-gnu-clang"
      }
    }
  },
  {
    "cmds": [
      {
        "cmd": {
          "args": [
            "../../usr/bin/clang",
            "--sysroot=/usr/x86_64-cros-linux-gnu",
            "-Qunused-arguments",
            "-Werror=poison-system-directories",
            "-Wno-deprecated-declarations",
            "-Wno-enum-constexpr-conversion",
            "-Wno-error=implicit-function-declaration",
            "-Wno-error=implicit-int",
            "-Wno-final-dtor-non-final-class",
            "-Wno-single-bit-bitfield-constant-conversion",
            "-Wno-tautological-constant-compare",
            "-Wno-tautological-unsigned-enum-zero-compare",
            "-Wno-unknown-warning-option",
            "-fdebug-default-version=5",
            "-Wno-int-conversion",
            "-Wno-incompatible-function-pointer-types",
            "-Wno-error=vla-cxx-extension",
            "-D_LIBCPP_ENABLE_CXX17_REMOVED_FEATURES",
            "-fclang-abi-compat=17",
            "-Wno-section",
            "-static-libgcc",
            "--prefix=../../bin/x86_64-cros-linux-gnu-",
            "-Wno-error=uninitialized",
            "main.cc",
            "-L/usr/x86_64-cros-linux-gnu/usr/lib64",
            "-mno-movbe",
            "-B../../bin",
            "-target",
            "x86_64-cros-linux-gnu"
          ],
          "env_updates": [
            "CCACHE_DIR=/var/cache/distfiles/ccache",
            "CCACHE_UMASK=002",
            "CCACHE_CPP2=yes"
          ],
          "path": "/usr/bin/ccache"
        }
      }
    ],
    "wd": "/tmp/stable",
    "wrapper": {
      "cmd": {
        "args": [
          "-Wno-error=maybe-uninitialized",
          "main.cc"
        ],
        "path": "./x86_64-cros-linux-gnu-clang"
      }
    }
  },
  {
    "cmds": [
      {
        "cmd": {
          "args": [
            "../../usr/bin/clang",
            "--sysroot=/usr/x86_64-cros-linux-gnu",
            "-Qunused-arguments",
            "-Werror=poison-system-directories",
            "-Wno-deprecated-declarations",
            "-Wno-enum-constexpr-conversion",
            "-Wno-error=implicit-function-declaration",
            "-Wno-error=implicit-int",
            "-Wno-final-dtor-non-final-class",
            "-Wno-single-bit-bitfield-constant-conversion",
            "-Wno-tautological-constant-compare",
            "-Wno-tautological-unsigned-enum-zero-compare",
            "-Wno-unknown-warning-option",
            "-fdebug-default-version=5",
            "-Wno-int-conversion",
            "-Wno-incompatible-function-pointer-types",
            "-Wno-error=vla-cxx-extension",
            "-D_LIBCPP_ENABLE_CXX17_REMOVED_FEATURES",
            "-fclang-abi-compat=17",
            "-Wno-section",
            "-static-libgcc",
            "--prefix=../../bin/x86_64-cros-linux-gnu-",
            "-someflag",
            "main.cc",
            "-L/usr/x86_64-cros-linux-gnu/usr/lib64",
            "-mno-movbe",
            "-B../../bin",
            "-target",
            "x86_64-cros-linux-gnu"
          ],
          "env_updates": [
            "CCACHE_DIR=/var/cache/distfiles/ccache",
            "CCACHE_UMASK=002",
            "CCACHE_CPP2=yes"
          ],
          "path": "/usr/bin/ccache"
        }
      }
    ],
    "wd": "/tmp/stable",
    "wrapper": {
      "cmd": {
        "args": [
          "-Xclang-only=-someflag",
          "main.cc"
        ],
        "path": "./x86_64-cros-linux-gnu-clang"
      }
    }
  }
]
