[
  {
    "cmds": [
      {
        "cmd": {
          "args": [
            "--sysroot=/usr/x86_64-cros-linux-gnu",
            "-Qunused-arguments",
            "-Werror=poison-system-directories",
            "-Wno-deprecated-declarations",
            "-Wno-enum-constexpr-conversion",
            "-Wno-error=implicit-function-declaration",
            "-Wno-error=implicit-int",
            "-Wno-final-dtor-non-final-class",
            "-Wno-single-bit-bitfield-constant-conversion",
            "-Wno-tautological-constant-compare",
            "-Wno-tautological-unsigned-enum-zero-compare",
            "-Wno-unknown-warning-option",
            "-fdebug-default-version=5",
            "-Wno-int-conversion",
            "-Wno-incompatible-function-pointer-types",
            "-Wno-error=vla-cxx-extension",
            "-D_LIBCPP_ENABLE_CXX17_REMOVED_FEATURES",
            "-fclang-abi-compat=17",
            "--unwindlib=libunwind",
            "-Wno-section",
            "-fno-addrsig",
            "-ftrivial-auto-var-init=zero",
            "-fcommon",
            "-fstack-protector-strong",
            "-D_FORTIFY_SOURCE=3",
            "-fno-omit-frame-pointer",
            "-static-libgcc",
            "--prefix=../../bin/x86_64-cros-linux-gnu-",
            "main.cc",
            "-L/usr/x86_64-cros-linux-gnu/usr/lib64",
            "-mno-movbe",
            "-B../../bin",
            "-target",
            "x86_64-cros-linux-gnu",
            "-fsyntax-only",
            "-stdlib=libstdc++"
          ],
          "path": "../../usr/bin/clang"
        }
      },
      {
        "cmd": {
          "args": [
            "./x86_64-cros-linux-gnu-gcc.real",
            "--sysroot=/usr/x86_64-cros-linux-gnu",
            "-fno-reorder-blocks-and-partition",
            "-Wno-unused-local-typedefs",
            "-Wno-maybe-uninitialized",
            "-fcommon",
            "-fstack-protector-strong",
            "-D_FORTIFY_SOURCE=3",
            "-fno-omit-frame-pointer",
            "-static-libgcc",
            "main.cc",
            "-L/usr/x86_64-cros-linux-gnu/usr/lib64",
            "-mno-movbe"
          ],
          "env_updates": [
            "CCACHE_DIR=/var/cache/distfiles/ccache",
            "CCACHE_UMASK=002"
          ],
          "path": "/usr/bin/ccache"
        }
      }
    ],
    "wd": "/tmp/stable",
    "wrapper": {
      "cmd": {
        "args": [
          "-clang-syntax",
          "main.cc"
        ],
        "path": "./x86_64-cros-linux-gnu-gcc"
      }
    }
  },
  {
    "cmds": [
      {
        "cmd": {
          "args": [
            "../../usr/bin/clang",
            "--sysroot=/usr/x86_64-cros-linux-gnu",
            "-Qunused-arguments",
            "-Werror=poison-system-directories",
            "-Wno-deprecated-declarations",
            "-Wno-enum-constexpr-conversion",
            "-Wno-error=implicit-function-declaration",
            "-Wno-error=implicit-int",
            "-Wno-final-dtor-non-final-class",
            "-Wno-single-bit-bitfield-constant-conversion",
            "-Wno-tautological-constant-compare",
            "-Wno-tautological-unsigned-enum-zero-compare",
            "-Wno-unknown-warning-option",
            "-fdebug-default-version=5",
            "-Wno-int-conversion",
            "-Wno-incompatible-function-pointer-types",
            "-Wno-error=vla-cxx-extension",
            "-D_LIBCPP_ENABLE_CXX17_REMOVED_FEATURES",
            "-fclang-abi-compat=17",
            "--unwindlib=libunwind",
            "-Wno-section",
            "-fno-addrsig",
            "-ftrivial-auto-var-init=zero",
            "-fcommon",
            "-fstack-protector-strong",
            "-D_FORTIFY_SOURCE=3",
            "-fno-omit-frame-pointer",
            "-static-libgcc",
            "--prefix=../../bin/x86_64-cros-linux-gnu-",
            "main.cc",
            "-L/usr/x86_64-cros-linux-gnu/usr/lib64",
            "-mno-movbe",
            "-B../../bin",
            "-target",
            "x86_64-cros-linux-gnu",
            "-fsyntax-only",
            "-stdlib=libstdc++"
          ],
          "path": "/tmp/stable/gomacc"
        }
      },
      {
        "cmd": {
          "args": [
            "./x86_64-cros-linux-gnu-gcc.real",
            "--sysroot=/usr/x86_64-cros-linux-gnu",
            "-fno-reorder-blocks-and-partition",
            "-Wno-unused-local-typedefs",
            "-Wno-maybe-uninitialized",
            "-fcommon",
            "-fstack-protector-strong",
            "-D_FORTIFY_SOURCE=3",
            "-fno-omit-frame-pointer",
            "-static-libgcc",
            "main.cc",
            "-L/usr/x86_64-cros-linux-gnu/usr/lib64",
            "-mno-movbe"
          ],
          "path": "/tmp/stable/gomacc"
        }
      }
    ],
    "env": [
      "GOMACC_PATH=/tmp/stable/gomacc"
    ],
    "wd": "/tmp/stable",
    "wrapper": {
      "cmd": {
        "args": [
          "-clang-syntax",
          "main.cc"
        ],
        "path": "./x86_64-cros-linux-gnu-gcc"
      }
    }
  },
  {
    "cmds": [
      {
        "cmd": {
          "args": [
            "--sysroot=/usr/x86_64-cros-linux-gnu",
            "-Qunused-arguments",
            "-Werror=poison-system-directories",
            "-Wno-deprecated-declarations",
            "-Wno-enum-constexpr-conversion",
            "-Wno-error=implicit-function-declaration",
            "-Wno-error=implicit-int",
            "-Wno-final-dtor-non-final-class",
            "-Wno-single-bit-bitfield-constant-conversion",
            "-Wno-tautological-constant-compare",
            "-Wno-tautological-unsigned-enum-zero-compare",
            "-Wno-unknown-warning-option",
            "-fdebug-default-version=5",
            "-Wno-int-conversion",
            "-Wno-incompatible-function-pointer-types",
            "-Wno-error=vla-cxx-extension",
            "-D_LIBCPP_ENABLE_CXX17_REMOVED_FEATURES",
            "-fclang-abi-compat=17",
            "--unwindlib=libunwind",
            "-Wno-section",
            "-fno-addrsig",
            "-ftrivial-auto-var-init=zero",
            "-fcommon",
            "-fstack-protector-strong",
            "-D_FORTIFY_SOURCE=3",
            "-fno-omit-frame-pointer",
            "-static-libgcc",
            "--prefix=../../bin/x86_64-cros-linux-gnu-",
            "main.cc",
            "-L/usr/x86_64-cros-linux-gnu/usr/lib64",
            "-mno-movbe",
            "-B../../bin",
            "-target",
            "x86_64-cros-linux-gnu",
            "-fsyntax-only",
            "-stdlib=libstdc++"
          ],
          "path": "../../usr/bin/clang"
        },
        "exitcode": 1,
        "stderr": "someerror",
        "stdout": "somemessage"
      }
    ],
    "wd": "/tmp/stable",
    "wrapper": {
      "cmd": {
        "args": [
          "-clang-syntax",
          "main.cc"
        ],
        "path": "./x86_64-cros-linux-gnu-gcc"
      },
      "exitcode": 1,
      "stderr": "someerror",
      "stdout": "somemessage"
    }
  },
  {
    "cmds": [
      {
        "cmd": {
          "args": [
            "--sysroot=/usr/x86_64-cros-linux-gnu",
            "-Qunused-arguments",
            "-Werror=poison-system-directories",
            "-Wno-deprecated-declarations",
            "-Wno-enum-constexpr-conversion",
            "-Wno-error=implicit-function-declaration",
            "-Wno-error=implicit-int",
            "-Wno-final-dtor-non-final-class",
            "-Wno-single-bit-bitfield-constant-conversion",
            "-Wno-tautological-constant-compare",
            "-Wno-tautological-unsigned-enum-zero-compare",
            "-Wno-unknown-warning-option",
            "-fdebug-default-version=5",
            "-Wno-int-conversion",
            "-Wno-incompatible-function-pointer-types",
            "-Wno-error=vla-cxx-extension",
            "-D_LIBCPP_ENABLE_CXX17_REMOVED_FEATURES",
            "-fclang-abi-compat=17",
            "--unwindlib=libunwind",
            "-Wno-section",
            "-fno-addrsig",
            "-ftrivial-auto-var-init=zero",
            "-fcommon",
            "-fstack-protector-strong",
            "-D_FORTIFY_SOURCE=3",
            "-fno-omit-frame-pointer",
            "-static-libgcc",
            "--prefix=../../bin/x86_64-cros-linux-gnu-",
            "main.cc",
            "-L/usr/x86_64-cros-linux-gnu/usr/lib64",
            "-mno-movbe",
            "-B../../bin",
            "-target",
            "x86_64-cros-linux-gnu",
            "-fsyntax-only",
            "-stdlib=libstdc++"
          ],
          "path": "../../usr/bin/clang"
        }
      },
      {
        "cmd": {
          "args": [
            "./x86_64-cros-linux-gnu-gcc.real",
            "--sysroot=/usr/x86_64-cros-linux-gnu",
            "-fno-reorder-blocks-and-partition",
            "-Wno-unused-local-typedefs",
            "-Wno-maybe-uninitialized",
            "-fcommon",
            "-fstack-protector-strong",
            "-D_FORTIFY_SOURCE=3",
            "-fno-omit-frame-pointer",
            "-static-libgcc",
            "main.cc",
            "-L/usr/x86_64-cros-linux-gnu/usr/lib64",
            "-mno-movbe"
          ],
          "env_updates": [
            "CCACHE_DIR=/var/cache/distfiles/ccache",
            "CCACHE_UMASK=002"
          ],
          "path": "/usr/bin/ccache"
        },
        "exitcode": 1,
        "stderr": "someerror",
        "stdout": "somemessage"
      }
    ],
    "wd": "/tmp/stable",
    "wrapper": {
      "cmd": {
        "args": [
          "-clang-syntax",
          "main.cc"
        ],
        "path": "./x86_64-cros-linux-gnu-gcc"
      },
      "exitcode": 1,
      "stderr": "someerror",
      "stdout": "somemessage"
    }
  }
]
