[
  {
    "cmds": [
      {
        "cmd": {
          "args": [
            "python3",
            "-c",
            "\nimport bisect_driver\nimport shlex\nimport sys\n\ndef ExpandArgs(args, target):\n\tfor arg in args:\n\t\tif arg[0] == '@':\n\t\t\twith open(arg[1:], 'r', encoding='utf-8') as f:\n\t\t\t\tExpandArgs(shlex.split(f.read()), target)\n\t\telse:\n\t\t\ttarget.append(arg)\n\treturn target\n\nstage = sys.argv[1]\ndir = sys.argv[2]\nexecargs = ExpandArgs(sys.argv[3:], [])\n\nsys.exit(bisect_driver.bisect_driver(stage, dir, execargs))\n",
            "someBisectStage",
            "/tmp/sysroot_bisect",
            "/usr/bin/ccache",
            "../../usr/bin/clang",
            "--sysroot=/usr/x86_64-cros-linux-gnu",
            "-Qunused-arguments",
            "-Werror=poison-system-directories",
            "-Wno-deprecated-declarations",
            "-Wno-enum-constexpr-conversion",
            "-Wno-error=implicit-function-declaration",
            "-Wno-error=implicit-int",
            "-Wno-final-dtor-non-final-class",
            "-Wno-single-bit-bitfield-constant-conversion",
            "-Wno-tautological-constant-compare",
            "-Wno-tautological-unsigned-enum-zero-compare",
            "-Wno-unknown-warning-option",
            "-fdebug-default-version=5",
            "-Wno-int-conversion",
            "-Wno-incompatible-function-pointer-types",
            "-Wno-error=vla-cxx-extension",
            "-D_LIBCPP_ENABLE_CXX17_REMOVED_FEATURES",
            "-fclang-abi-compat=17",
            "--unwindlib=libunwind",
            "-Wno-section",
            "-fno-addrsig",
            "-ftrivial-auto-var-init=zero",
            "-fcommon",
            "-fstack-protector-strong",
            "-D_FORTIFY_SOURCE=3",
            "-fno-omit-frame-pointer",
            "-static-libgcc",
            "--prefix=../../bin/x86_64-cros-linux-gnu-",
            "main.cc",
            "-L/usr/x86_64-cros-linux-gnu/usr/lib64",
            "-mno-movbe",
            "-B../../bin",
            "-target",
            "x86_64-cros-linux-gnu"
          ],
          "env_updates": [
            "CCACHE_DIR=/var/cache/distfiles/ccache",
            "CCACHE_UMASK=002",
            "CCACHE_CPP2=yes",
            "PYTHONPATH=/somepath/test_binary"
          ],
          "path": "/usr/bin/env"
        }
      }
    ],
    "env": [
      "BISECT_STAGE=someBisectStage",
      "HOME=/user/home"
    ],
    "wd": "/tmp/stable",
    "wrapper": {
      "cmd": {
        "args": [
          "main.cc"
        ],
        "path": "./x86_64-cros-linux-gnu-clang"
      }
    }
  },
  {
    "cmds": [
      {
        "cmd": {
          "args": [
            "python3",
            "-c",
            "\nimport bisect_driver\nimport shlex\nimport sys\n\ndef ExpandArgs(args, target):\n\tfor arg in args:\n\t\tif arg[0] == '@':\n\t\t\twith open(arg[1:], 'r', encoding='utf-8') as f:\n\t\t\t\tExpandArgs(shlex.split(f.read()), target)\n\t\telse:\n\t\t\ttarget.append(arg)\n\treturn target\n\nstage = sys.argv[1]\ndir = sys.argv[2]\nexecargs = ExpandArgs(sys.argv[3:], [])\n\nsys.exit(bisect_driver.bisect_driver(stage, dir, execargs))\n",
            "someBisectStage",
            "someBisectDir",
            "/usr/bin/ccache",
            "../../usr/bin/clang",
            "--sysroot=/usr/x86_64-cros-linux-gnu",
            "-Qunused-arguments",
            "-Werror=poison-system-directories",
            "-Wno-deprecated-declarations",
            "-Wno-enum-constexpr-conversion",
            "-Wno-error=implicit-function-declaration",
            "-Wno-error=implicit-int",
            "-Wno-final-dtor-non-final-class",
            "-Wno-single-bit-bitfield-constant-conversion",
            "-Wno-tautological-constant-compare",
            "-Wno-tautological-unsigned-enum-zero-compare",
            "-Wno-unknown-warning-option",
            "-fdebug-default-version=5",
            "-Wno-int-conversion",
            "-Wno-incompatible-function-pointer-types",
            "-Wno-error=vla-cxx-extension",
            "-D_LIBCPP_ENABLE_CXX17_REMOVED_FEATURES",
            "-fclang-abi-compat=17",
            "--unwindlib=libunwind",
            "-Wno-section",
            "-fno-addrsig",
            "-ftrivial-auto-var-init=zero",
            "-fcommon",
            "-fstack-protector-strong",
            "-D_FORTIFY_SOURCE=3",
            "-fno-omit-frame-pointer",
            "-static-libgcc",
            "--prefix=../../bin/x86_64-cros-linux-gnu-",
            "main.cc",
            "-L/usr/x86_64-cros-linux-gnu/usr/lib64",
            "-mno-movbe",
            "-B../../bin",
            "-target",
            "x86_64-cros-linux-gnu"
          ],
          "env_updates": [
            "CCACHE_DIR=/var/cache/distfiles/ccache",
            "CCACHE_UMASK=002",
            "CCACHE_CPP2=yes",
            "PYTHONPATH=/somepath/test_binary"
          ],
          "path": "/usr/bin/env"
        }
      }
    ],
    "env": [
      "BISECT_STAGE=someBisectStage",
      "BISECT_DIR=someBisectDir",
      "HOME=/user/home"
    ],
    "wd": "/tmp/stable",
    "wrapper": {
      "cmd": {
        "args": [
          "main.cc"
        ],
        "path": "./x86_64-cros-linux-gnu-clang"
      }
    }
  },
  {
    "cmds": [
      {
        "cmd": {
          "args": [
            "python3",
            "-c",
            "\nimport bisect_driver\nimport shlex\nimport sys\n\ndef ExpandArgs(args, target):\n\tfor arg in args:\n\t\tif arg[0] == '@':\n\t\t\twith open(arg[1:], 'r', encoding='utf-8') as f:\n\t\t\t\tExpandArgs(shlex.split(f.read()), target)\n\t\telse:\n\t\t\ttarget.append(arg)\n\treturn target\n\nstage = sys.argv[1]\ndir = sys.argv[2]\nexecargs = ExpandArgs(sys.argv[3:], [])\n\nsys.exit(bisect_driver.bisect_driver(stage, dir, execargs))\n",
            "someBisectStage",
            "someBisectDir",
            "/usr/bin/ccache",
            "../../usr/bin/clang",
            "--sysroot=/usr/x86_64-cros-linux-gnu",
            "-Qunused-arguments",
            "-Werror=poison-system-directories",
            "-Wno-deprecated-declarations",
            "-Wno-enum-constexpr-conversion",
            "-Wno-error=implicit-function-declaration",
            "-Wno-error=implicit-int",
            "-Wno-final-dtor-non-final-class",
            "-Wno-single-bit-bitfield-constant-conversion",
            "-Wno-tautological-constant-compare",
            "-Wno-tautological-unsigned-enum-zero-compare",
            "-Wno-unknown-warning-option",
            "-fdebug-default-version=5",
            "-Wno-int-conversion",
            "-Wno-incompatible-function-pointer-types",
            "-Wno-error=vla-cxx-extension",
            "-D_LIBCPP_ENABLE_CXX17_REMOVED_FEATURES",
            "-fclang-abi-compat=17",
            "--unwindlib=libunwind",
            "-Wno-section",
            "-fno-addrsig",
            "-ftrivial-auto-var-init=zero",
            "-fcommon",
            "-fstack-protector-strong",
            "-D_FORTIFY_SOURCE=3",
            "-fno-omit-frame-pointer",
            "-static-libgcc",
            "--prefix=../../bin/x86_64-cros-linux-gnu-",
            "main.cc",
            "-L/usr/x86_64-cros-linux-gnu/usr/lib64",
            "-mno-movbe",
            "-B../../bin",
            "-target",
            "x86_64-cros-linux-gnu"
          ],
          "env_updates": [
            "CCACHE_DIR=/var/cache/distfiles/ccache",
            "CCACHE_UMASK=002",
            "CCACHE_CPP2=yes",
            "PYTHONPATH=/somepath/test_binary"
          ],
          "path": "/usr/bin/env"
        },
        "exitcode": 1,
        "stderr": "someerror",
        "stdout": "somemessage"
      }
    ],
    "env": [
      "BISECT_STAGE=someBisectStage",
      "BISECT_DIR=someBisectDir",
      "HOME=/user/home"
    ],
    "wd": "/tmp/stable",
    "wrapper": {
      "cmd": {
        "args": [
          "main.cc"
        ],
        "path": "./x86_64-cros-linux-gnu-clang"
      },
      "exitcode": 1,
      "stderr": "someerror",
      "stdout": "somemessage"
    }
  }
]
