[
  {
    "cmds": [
      {
        "cmd": {
          "args": [
            "--sysroot=/usr/x86_64-cros-linux-gnu",
            "-Qunused-arguments",
            "-Werror=poison-system-directories",
            "-Wno-deprecated-declarations",
            "-Wno-enum-constexpr-conversion",
            "-Wno-error=implicit-function-declaration",
            "-Wno-error=implicit-int",
            "-Wno-final-dtor-non-final-class",
            "-Wno-single-bit-bitfield-constant-conversion",
            "-Wno-tautological-constant-compare",
            "-Wno-tautological-unsigned-enum-zero-compare",
            "-Wno-unknown-warning-option",
            "-fdebug-default-version=5",
            "-Wno-int-conversion",
            "-Wno-incompatible-function-pointer-types",
            "-Wno-error=vla-cxx-extension",
            "-D_LIBCPP_ENABLE_CXX17_REMOVED_FEATURES",
            "-fclang-abi-compat=17",
            "--unwindlib=libunwind",
            "-Wno-section",
            "-fno-addrsig",
            "-ftrivial-auto-var-init=zero",
            "-fcommon",
            "-fstack-protector-strong",
            "-D_FORTIFY_SOURCE=3",
            "-fno-omit-frame-pointer",
            "-static-libgcc",
            "--prefix=../../bin/x86_64-cros-linux-gnu-",
            "main.cc",
            "-L/usr/x86_64-cros-linux-gnu/usr/lib64",
            "-mno-movbe",
            "-B../../bin",
            "-target",
            "x86_64-cros-linux-gnu"
          ],
          "path": "../../usr/bin/clang"
        }
      }
    ],
    "wd": "/tmp/stable",
    "wrapper": {
      "cmd": {
        "args": [
          "main.cc"
        ],
        "path": "./x86_64-cros-linux-gnu-clang"
      }
    }
  },
  {
    "cmds": [
      {
        "cmd": {
          "args": [
            "--sysroot=/usr/x86_64-cros-linux-gnu",
            "-Qunused-arguments",
            "-Werror=poison-system-directories",
            "-Wno-deprecated-declarations",
            "-Wno-enum-constexpr-conversion",
            "-Wno-error=implicit-function-declaration",
            "-Wno-error=implicit-int",
            "-Wno-final-dtor-non-final-class",
            "-Wno-single-bit-bitfield-constant-conversion",
            "-Wno-tautological-constant-compare",
            "-Wno-tautological-unsigned-enum-zero-compare",
            "-Wno-unknown-warning-option",
            "-fdebug-default-version=5",
            "-Wno-int-conversion",
            "-Wno-incompatible-function-pointer-types",
            "-Wno-error=vla-cxx-extension",
            "-D_LIBCPP_ENABLE_CXX17_REMOVED_FEATURES",
            "-fclang-abi-compat=17",
            "--unwindlib=libunwind",
            "-Wno-section",
            "-fno-addrsig",
            "-ftrivial-auto-var-init=zero",
            "-fcommon",
            "-fstack-protector-strong",
            "-D_FORTIFY_SOURCE=3",
            "-fno-omit-frame-pointer",
            "-static-libgcc",
            "--prefix=../../bin/x86_64-cros-linux-gnu-",
            "main.cc",
            "-L/usr/x86_64-cros-linux-gnu/usr/lib64",
            "-mno-movbe",
            "-B../../bin",
            "-target",
            "x86_64-cros-linux-gnu"
          ],
          "path": "../../usr/bin/clang"
        },
        "exitcode": 1,
        "stderr": "someerror",
        "stdout": "somemessage"
      }
    ],
    "wd": "/tmp/stable",
    "wrapper": {
      "cmd": {
        "args": [
          "main.cc"
        ],
        "path": "./x86_64-cros-linux-gnu-clang"
      },
      "exitcode": 1,
      "stderr": "someerror",
      "stdout": "somemessage"
    }
  },
  {
    "cmds": [
      {
        "cmd": {
          "args": [
            "--sysroot=/usr/x86_64-cros-linux-gnu",
            "-Qunused-arguments",
            "-Werror=poison-system-directories",
            "-Wno-deprecated-declarations",
            "-Wno-enum-constexpr-conversion",
            "-Wno-error=implicit-function-declaration",
            "-Wno-error=implicit-int",
            "-Wno-final-dtor-non-final-class",
            "-Wno-single-bit-bitfield-constant-conversion",
            "-Wno-tautological-constant-compare",
            "-Wno-tautological-unsigned-enum-zero-compare",
            "-Wno-unknown-warning-option",
            "-fdebug-default-version=5",
            "-Wno-int-conversion",
            "-Wno-incompatible-function-pointer-types",
            "-Wno-error=vla-cxx-extension",
            "-D_LIBCPP_ENABLE_CXX17_REMOVED_FEATURES",
            "-fclang-abi-compat=17",
            "--unwindlib=libunwind",
            "-Wno-section",
            "-fno-addrsig",
            "-ftrivial-auto-var-init=zero",
            "-fcommon",
            "-fstack-protector-strong",
            "-D_FORTIFY_SOURCE=3",
            "-fno-omit-frame-pointer",
            "-static-libgcc",
            "--prefix=../../bin/x86_64-cros-linux-gnu-",
            "main.cc",
            "-L/usr/x86_64-cros-linux-gnu/usr/lib64",
            "-mno-movbe",
            "-B../../bin",
            "-target",
            "x86_64-cros-linux-gnu"
          ],
          "path": "../../usr/bin/clang++"
        }
      }
    ],
    "wd": "/tmp/stable",
    "wrapper": {
      "cmd": {
        "args": [
          "main.cc"
        ],
        "path": "./x86_64-cros-linux-gnu-clang++"
      }
    }
  },
  {
    "cmds": [
      {
        "cmd": {
          "args": [
            "--sysroot=/usr/x86_64-cros-linux-gnu",
            "-Qunused-arguments",
            "-Werror=poison-system-directories",
            "-Wno-deprecated-declarations",
            "-Wno-enum-constexpr-conversion",
            "-Wno-error=implicit-function-declaration",
            "-Wno-error=implicit-int",
            "-Wno-final-dtor-non-final-class",
            "-Wno-single-bit-bitfield-constant-conversion",
            "-Wno-tautological-constant-compare",
            "-Wno-tautological-unsigned-enum-zero-compare",
            "-Wno-unknown-warning-option",
            "-fdebug-default-version=5",
            "-Wno-int-conversion",
            "-Wno-incompatible-function-pointer-types",
            "-Wno-error=vla-cxx-extension",
            "-D_LIBCPP_ENABLE_CXX17_REMOVED_FEATURES",
            "-fclang-abi-compat=17",
            "--unwindlib=libunwind",
            "-Wno-section",
            "-fno-addrsig",
            "-ftrivial-auto-var-init=zero",
            "-fcommon",
            "-fstack-protector-strong",
            "-D_FORTIFY_SOURCE=3",
            "-fno-omit-frame-pointer",
            "-static-libgcc",
            "--prefix=../../bin/x86_64-cros-linux-gnu-",
            "main.cc",
            "-L/usr/x86_64-cros-linux-gnu/usr/lib64",
            "-mno-movbe",
            "-B../../bin",
            "-target",
            "x86_64-cros-linux-gnu"
          ],
          "path": "somepath/clang"
        }
      }
    ],
    "env": [
      "CLANG=somepath/clang"
    ],
    "wd": "/tmp/stable",
    "wrapper": {
      "cmd": {
        "args": [
          "main.cc"
        ],
        "path": "./x86_64-cros-linux-gnu-clang"
      }
    }
  },
  {
    "cmds": [
      {
        "cmd": {
          "args": [
            "--print-resource-dir"
          ],
          "path": "../../usr/bin/clang"
        },
        "stdout": "someResourceDir"
      },
      {
        "cmd": {
          "args": [
            "--sysroot=/usr/x86_64-cros-linux-gnu",
            "-Qunused-arguments",
            "-Werror=poison-system-directories",
            "-Wno-deprecated-declarations",
            "-Wno-enum-constexpr-conversion",
            "-Wno-error=implicit-function-declaration",
            "-Wno-error=implicit-int",
            "-Wno-final-dtor-non-final-class",
            "-Wno-single-bit-bitfield-constant-conversion",
            "-Wno-tautological-constant-compare",
            "-Wno-tautological-unsigned-enum-zero-compare",
            "-Wno-unknown-warning-option",
            "-fdebug-default-version=5",
            "-Wno-int-conversion",
            "-Wno-incompatible-function-pointer-types",
            "-Wno-error=vla-cxx-extension",
            "-D_LIBCPP_ENABLE_CXX17_REMOVED_FEATURES",
            "-fclang-abi-compat=17",
            "--unwindlib=libunwind",
            "-Wno-section",
            "-fno-addrsig",
            "-ftrivial-auto-var-init=zero",
            "-fcommon",
            "-fstack-protector-strong",
            "-D_FORTIFY_SOURCE=3",
            "-fno-omit-frame-pointer",
            "-static-libgcc",
            "--prefix=../../bin/x86_64-cros-linux-gnu-",
            "-resource-dir=someResourceDir",
            "--gcc-toolchain=/usr",
            "main.cc",
            "-L/usr/x86_64-cros-linux-gnu/usr/lib64",
            "-mno-movbe",
            "-B../../bin",
            "-target",
            "x86_64-cros-linux-gnu"
          ],
          "path": "/somedir/clang"
        }
      }
    ],
    "wd": "/tmp/stable",
    "wrapper": {
      "cmd": {
        "args": [
          "-Xclang-path=/somedir",
          "main.cc"
        ],
        "path": "./x86_64-cros-linux-gnu-clang"
      }
    }
  },
  {
    "cmds": [
      {
        "cmd": {
          "args": [
            "--print-resource-dir"
          ],
          "path": "../../usr/bin/clang"
        },
        "stdout": "someResourceDir"
      },
      {
        "cmd": {
          "args": [
            "/somedir/clang",
            "--sysroot=/usr/x86_64-cros-linux-gnu",
            "-Qunused-arguments",
            "-Werror=poison-system-directories",
            "-Wno-deprecated-declarations",
            "-Wno-enum-constexpr-conversion",
            "-Wno-error=implicit-function-declaration",
            "-Wno-error=implicit-int",
            "-Wno-final-dtor-non-final-class",
            "-Wno-single-bit-bitfield-constant-conversion",
            "-Wno-tautological-constant-compare",
            "-Wno-tautological-unsigned-enum-zero-compare",
            "-Wno-unknown-warning-option",
            "-fdebug-default-version=5",
            "-Wno-int-conversion",
            "-Wno-incompatible-function-pointer-types",
            "-Wno-error=vla-cxx-extension",
            "-D_LIBCPP_ENABLE_CXX17_REMOVED_FEATURES",
            "-fclang-abi-compat=17",
            "--unwindlib=libunwind",
            "-Wno-section",
            "-fno-addrsig",
            "-ftrivial-auto-var-init=zero",
            "-fcommon",
            "-fstack-protector-strong",
            "-D_FORTIFY_SOURCE=3",
            "-fno-omit-frame-pointer",
            "-static-libgcc",
            "--prefix=../../bin/x86_64-cros-linux-gnu-",
            "-resource-dir=someResourceDir",
            "--gcc-toolchain=/usr",
            "main.cc",
            "-L/usr/x86_64-cros-linux-gnu/usr/lib64",
            "-mno-movbe",
            "-B../../bin",
            "-target",
            "x86_64-cros-linux-gnu"
          ],
          "path": "/tmp/stable/gomacc"
        }
      }
    ],
    "env": [
      "GOMACC_PATH=/tmp/stable/gomacc"
    ],
    "wd": "/tmp/stable",
    "wrapper": {
      "cmd": {
        "args": [
          "-Xclang-path=/somedir",
          "main.cc"
        ],
        "path": "./x86_64-cros-linux-gnu-clang"
      }
    }
  },
  {
    "cmds": [
      {
        "cmd": {
          "args": [
            "--print-resource-dir"
          ],
          "path": "../../usr/bin/clang"
        },
        "stdout": "someResourceDir"
      },
      {
        "cmd": {
          "args": [
            "--sysroot=/usr/x86_64-cros-linux-gnu",
            "-Qunused-arguments",
            "-Werror=poison-system-directories",
            "-Wno-deprecated-declarations",
            "-Wno-enum-constexpr-conversion",
            "-Wno-error=implicit-function-declaration",
            "-Wno-error=implicit-int",
            "-Wno-final-dtor-non-final-class",
            "-Wno-single-bit-bitfield-constant-conversion",
            "-Wno-tautological-constant-compare",
            "-Wno-tautological-unsigned-enum-zero-compare",
            "-Wno-unknown-warning-option",
            "-fdebug-default-version=5",
            "-Wno-int-conversion",
            "-Wno-incompatible-function-pointer-types",
            "-Wno-error=vla-cxx-extension",
            "-D_LIBCPP_ENABLE_CXX17_REMOVED_FEATURES",
            "-fclang-abi-compat=17",
            "--unwindlib=libunwind",
            "-Wno-section",
            "-fno-addrsig",
            "-ftrivial-auto-var-init=zero",
            "-fcommon",
            "-fstack-protector-strong",
            "-D_FORTIFY_SOURCE=3",
            "-fno-omit-frame-pointer",
            "-static-libgcc",
            "--prefix=../../bin/x86_64-cros-linux-gnu-",
            "-resource-dir=someResourceDir",
            "--gcc-toolchain=/usr",
            "main.cc",
            "-L/usr/x86_64-cros-linux-gnu/usr/lib64",
            "-mno-movbe",
            "-B../../bin",
            "-target",
            "x86_64-cros-linux-gnu"
          ],
          "path": "/somedir/clang"
        },
        "exitcode": 1,
        "stderr": "someerror",
        "stdout": "somemessage"
      }
    ],
    "wd": "/tmp/stable",
    "wrapper": {
      "cmd": {
        "args": [
          "-Xclang-path=/somedir",
          "main.cc"
        ],
        "path": "./x86_64-cros-linux-gnu-clang"
      },
      "exitcode": 1,
      "stderr": "someerror",
      "stdout": "somemessage"
    }
  },
  {
    "cmds": [
      {
        "cmd": {
          "args": [
            "--sysroot=/usr/x86_64-cros-linux-gnu",
            "-Qunused-arguments",
            "-Werror=poison-system-directories",
            "-Wno-deprecated-declarations",
            "-Wno-enum-constexpr-conversion",
            "-Wno-error=implicit-function-declaration",
            "-Wno-error=implicit-int",
            "-Wno-final-dtor-non-final-class",
            "-Wno-single-bit-bitfield-constant-conversion",
            "-Wno-tautological-constant-compare",
            "-Wno-tautological-unsigned-enum-zero-compare",
            "-Wno-unknown-warning-option",
            "-fdebug-default-version=5",
            "-Wno-int-conversion",
            "-Wno-incompatible-function-pointer-types",
            "-Wno-error=vla-cxx-extension",
            "-D_LIBCPP_ENABLE_CXX17_REMOVED_FEATURES",
            "-fclang-abi-compat=17",
            "--unwindlib=libunwind",
            "-Wno-section",
            "-fno-addrsig",
            "-ftrivial-auto-var-init=zero",
            "-fcommon",
            "-fstack-protector-strong",
            "-D_FORTIFY_SOURCE=3",
            "-fno-omit-frame-pointer",
            "-static-libgcc",
            "--prefix=../../bin/x86_64-cros-linux-gnu-",
            "main.cc",
            "-L/usr/x86_64-cros-linux-gnu/usr/lib64",
            "-mno-movbe",
            "-B../../bin",
            "-target",
            "x86_64-cros-linux-gnu"
          ],
          "path": "/usr/bin/clang"
        }
      }
    ],
    "wd": "/tmp/stable",
    "wrapper": {
      "cmd": {
        "args": [
          "main.cc"
        ],
        "path": "/tmp/stable/x86_64-cros-linux-gnu-clang"
      }
    }
  },
  {
    "cmds": [
      {
        "cmd": {
          "args": [
            "--sysroot=/tmp/stable/a/b/c/d/e/usr/x86_64-cros-linux-gnu",
            "-Qunused-arguments",
            "-Werror=poison-system-directories",
            "-Wno-deprecated-declarations",
            "-Wno-enum-constexpr-conversion",
            "-Wno-error=implicit-function-declaration",
            "-Wno-error=implicit-int",
            "-Wno-final-dtor-non-final-class",
            "-Wno-single-bit-bitfield-constant-conversion",
            "-Wno-tautological-constant-compare",
            "-Wno-tautological-unsigned-enum-zero-compare",
            "-Wno-unknown-warning-option",
            "-fdebug-default-version=5",
            "-Wno-int-conversion",
            "-Wno-incompatible-function-pointer-types",
            "-Wno-error=vla-cxx-extension",
            "-D_LIBCPP_ENABLE_CXX17_REMOVED_FEATURES",
            "-fclang-abi-compat=17",
            "--unwindlib=libunwind",
            "-Wno-section",
            "-fno-addrsig",
            "-ftrivial-auto-var-init=zero",
            "-fcommon",
            "-fstack-protector-strong",
            "-D_FORTIFY_SOURCE=3",
            "-fno-omit-frame-pointer",
            "-static-libgcc",
            "--prefix=a/b/c/d/e/bin/x86_64-cros-linux-gnu-",
            "main.cc",
            "-L/tmp/stable/a/b/c/d/e/usr/x86_64-cros-linux-gnu/usr/lib64",
            "-mno-movbe",
            "-Ba/b/c/d/e/bin",
            "-target",
            "x86_64-cros-linux-gnu"
          ],
          "path": "a/b/c/d/e/usr/bin/clang"
        }
      }
    ],
    "wd": "/tmp/stable",
    "wrapper": {
      "cmd": {
        "args": [
          "main.cc"
        ],
        "path": "./a/b/c/d/e/f/g/x86_64-cros-linux-gnu-clang"
      }
    }
  },
  {
    "cmds": [
      {
        "cmd": {
          "args": [
            "--sysroot=/tmp/stable/a/b/c/d/e/usr/x86_64-cros-linux-gnu",
            "-Qunused-arguments",
            "-Werror=poison-system-directories",
            "-Wno-deprecated-declarations",
            "-Wno-enum-constexpr-conversion",
            "-Wno-error=implicit-function-declaration",
            "-Wno-error=implicit-int",
            "-Wno-final-dtor-non-final-class",
            "-Wno-single-bit-bitfield-constant-conversion",
            "-Wno-tautological-constant-compare",
            "-Wno-tautological-unsigned-enum-zero-compare",
            "-Wno-unknown-warning-option",
            "-fdebug-default-version=5",
            "-Wno-int-conversion",
            "-Wno-incompatible-function-pointer-types",
            "-Wno-error=vla-cxx-extension",
            "-D_LIBCPP_ENABLE_CXX17_REMOVED_FEATURES",
            "-fclang-abi-compat=17",
            "--unwindlib=libunwind",
            "-Wno-section",
            "-fno-addrsig",
            "-ftrivial-auto-var-init=zero",
            "-fcommon",
            "-fstack-protector-strong",
            "-D_FORTIFY_SOURCE=3",
            "-fno-omit-frame-pointer",
            "-static-libgcc",
            "--prefix=a/b/c/d/e/bin/x86_64-cros-linux-gnu-",
            "main.cc",
            "-L/tmp/stable/a/b/c/d/e/usr/x86_64-cros-linux-gnu/usr/lib64",
            "-mno-movbe",
            "-Ba/b/c/d/e/bin",
            "-target",
            "x86_64-cros-linux-gnu"
          ],
          "path": "a/b/c/d/e/usr/bin/clang"
        }
      }
    ],
    "wd": "/tmp/stable",
    "wrapper": {
      "cmd": {
        "args": [
          "main.cc"
        ],
        "path": "./symlinked/x86_64-cros-linux-gnu-clang"
      }
    }
  },
  {
    "cmds": [
      {
        "cmd": {
          "args": [
            "--sysroot=/tmp/usr/x86_64-cros-linux-gnu",
            "-Qunused-arguments",
            "-Werror=poison-system-directories",
            "-Wno-deprecated-declarations",
            "-Wno-enum-constexpr-conversion",
            "-Wno-error=implicit-function-declaration",
            "-Wno-error=implicit-int",
            "-Wno-final-dtor-non-final-class",
            "-Wno-single-bit-bitfield-constant-conversion",
            "-Wno-tautological-constant-compare",
            "-Wno-tautological-unsigned-enum-zero-compare",
            "-Wno-unknown-warning-option",
            "-fdebug-default-version=5",
            "-Wno-int-conversion",
            "-Wno-incompatible-function-pointer-types",
            "-Wno-error=vla-cxx-extension",
            "-D_LIBCPP_ENABLE_CXX17_REMOVED_FEATURES",
            "-fclang-abi-compat=17",
            "--unwindlib=libunwind",
            "-Wno-section",
            "-fno-addrsig",
            "-ftrivial-auto-var-init=zero",
            "-fcommon",
            "-fstack-protector-strong",
            "-D_FORTIFY_SOURCE=3",
            "-fno-omit-frame-pointer",
            "-static-libgcc",
            "--prefix=../bin/x86_64-cros-linux-gnu-",
            "main.cc",
            "-L/tmp/usr/x86_64-cros-linux-gnu/usr/lib64",
            "-mno-movbe",
            "-B../bin",
            "-target",
            "x86_64-cros-linux-gnu"
          ],
          "path": "../usr/bin/clang"
        }
      }
    ],
    "wd": "/tmp/stable",
    "wrapper": {
      "cmd": {
        "args": [
          "main.cc"
        ],
        "path": "somedir/x86_64-cros-linux-gnu-clang"
      }
    }
  },
  {
    "cmds": [
      {
        "cmd": {
          "args": [
            "--sysroot=/tmp/usr/x86_64-cros-linux-gnu",
            "-Qunused-arguments",
            "-Werror=poison-system-directories",
            "-Wno-deprecated-declarations",
            "-Wno-enum-constexpr-conversion",
            "-Wno-error=implicit-function-declaration",
            "-Wno-error=implicit-int",
            "-Wno-final-dtor-non-final-class",
            "-Wno-single-bit-bitfield-constant-conversion",
            "-Wno-tautological-constant-compare",
            "-Wno-tautological-unsigned-enum-zero-compare",
            "-Wno-unknown-warning-option",
            "-fdebug-default-version=5",
            "-Wno-int-conversion",
            "-Wno-incompatible-function-pointer-types",
            "-Wno-error=vla-cxx-extension",
            "-D_LIBCPP_ENABLE_CXX17_REMOVED_FEATURES",
            "-fclang-abi-compat=17",
            "--unwindlib=libunwind",
            "-Wno-section",
            "-fno-addrsig",
            "-ftrivial-auto-var-init=zero",
            "-fcommon",
            "-fstack-protector-strong",
            "-D_FORTIFY_SOURCE=3",
            "-fno-omit-frame-pointer",
            "-static-libgcc",
            "--prefix=../bin/x86_64-cros-linux-gnu-",
            "main.cc",
            "-L/tmp/usr/x86_64-cros-linux-gnu/usr/lib64",
            "-mno-movbe",
            "-B../bin",
            "-target",
            "x86_64-cros-linux-gnu"
          ],
          "path": "/tmp/usr/bin/clang"
        }
      }
    ],
    "env": [
      "PATH=/tmp/stable/pathenv"
    ],
    "wd": "/tmp/stable",
    "wrapper": {
      "cmd": {
        "args": [
          "main.cc"
        ],
        "path": "x86_64-cros-linux-gnu-clang"
      }
    }
  }
]
