[
  {
    "cmds": [
      {
        "cmd": {
          "args": [
            "-Qunused-arguments",
            "-Werror=poison-system-directories",
            "-Wno-deprecated-declarations",
            "-Wno-enum-constexpr-conversion",
            "-Wno-error=implicit-function-declaration",
            "-Wno-error=implicit-int",
            "-Wno-final-dtor-non-final-class",
            "-Wno-single-bit-bitfield-constant-conversion",
            "-Wno-tautological-constant-compare",
            "-Wno-tautological-unsigned-enum-zero-compare",
            "-Wno-unknown-warning-option",
            "-fdebug-default-version=5",
            "-Wno-int-conversion",
            "-Wno-incompatible-function-pointer-types",
            "-Wno-error=vla-cxx-extension",
            "-D_LIBCPP_ENABLE_CXX17_REMOVED_FEATURES",
            "-fclang-abi-compat=17",
            "-Wno-unused-local-typedefs",
            "-fno-addrsig",
            "-fcommon",
            "-fsanitize=kernel-address",
            "main.cc"
          ],
          "path": "/tmp/stable/clang"
        }
      }
    ],
    "wd": "/tmp/stable",
    "wrapper": {
      "cmd": {
        "args": [
          "-fsanitize=kernel-address",
          "-Wl,--no-undefined",
          "main.cc"
        ],
        "path": "./x86_64-cros-linux-gnu-clang"
      }
    }
  },
  {
    "cmds": [
      {
        "cmd": {
          "args": [
            "-Qunused-arguments",
            "-Werror=poison-system-directories",
            "-Wno-deprecated-declarations",
            "-Wno-enum-constexpr-conversion",
            "-Wno-error=implicit-function-declaration",
            "-Wno-error=implicit-int",
            "-Wno-final-dtor-non-final-class",
            "-Wno-single-bit-bitfield-constant-conversion",
            "-Wno-tautological-constant-compare",
            "-Wno-tautological-unsigned-enum-zero-compare",
            "-Wno-unknown-warning-option",
            "-fdebug-default-version=5",
            "-Wno-int-conversion",
            "-Wno-incompatible-function-pointer-types",
            "-Wno-error=vla-cxx-extension",
            "-D_LIBCPP_ENABLE_CXX17_REMOVED_FEATURES",
            "-fclang-abi-compat=17",
            "-Wno-unused-local-typedefs",
            "-fno-addrsig",
            "-fcommon",
            "-fsanitize=kernel-address",
            "main.cc"
          ],
          "path": "/tmp/stable/clang"
        }
      }
    ],
    "wd": "/tmp/stable",
    "wrapper": {
      "cmd": {
        "args": [
          "-fsanitize=kernel-address",
          "-Wl,-z,defs",
          "main.cc"
        ],
        "path": "./x86_64-cros-linux-gnu-clang"
      }
    }
  },
  {
    "cmds": [
      {
        "cmd": {
          "args": [
            "-Qunused-arguments",
            "-Werror=poison-system-directories",
            "-Wno-deprecated-declarations",
            "-Wno-enum-constexpr-conversion",
            "-Wno-error=implicit-function-declaration",
            "-Wno-error=implicit-int",
            "-Wno-final-dtor-non-final-class",
            "-Wno-single-bit-bitfield-constant-conversion",
            "-Wno-tautological-constant-compare",
            "-Wno-tautological-unsigned-enum-zero-compare",
            "-Wno-unknown-warning-option",
            "-fdebug-default-version=5",
            "-Wno-int-conversion",
            "-Wno-incompatible-function-pointer-types",
            "-Wno-error=vla-cxx-extension",
            "-D_LIBCPP_ENABLE_CXX17_REMOVED_FEATURES",
            "-fclang-abi-compat=17",
            "-Wno-unused-local-typedefs",
            "-fno-addrsig",
            "-fcommon",
            "-fsanitize=kernel-address",
            "main.cc"
          ],
          "path": "/tmp/stable/clang"
        }
      }
    ],
    "wd": "/tmp/stable",
    "wrapper": {
      "cmd": {
        "args": [
          "-fsanitize=kernel-address",
          "-D_FORTIFY_SOURCE=1",
          "main.cc"
        ],
        "path": "./x86_64-cros-linux-gnu-clang"
      }
    }
  },
  {
    "cmds": [
      {
        "cmd": {
          "args": [
            "-Qunused-arguments",
            "-Werror=poison-system-directories",
            "-Wno-deprecated-declarations",
            "-Wno-enum-constexpr-conversion",
            "-Wno-error=implicit-function-declaration",
            "-Wno-error=implicit-int",
            "-Wno-final-dtor-non-final-class",
            "-Wno-single-bit-bitfield-constant-conversion",
            "-Wno-tautological-constant-compare",
            "-Wno-tautological-unsigned-enum-zero-compare",
            "-Wno-unknown-warning-option",
            "-fdebug-default-version=5",
            "-Wno-int-conversion",
            "-Wno-incompatible-function-pointer-types",
            "-Wno-error=vla-cxx-extension",
            "-D_LIBCPP_ENABLE_CXX17_REMOVED_FEATURES",
            "-fclang-abi-compat=17",
            "-Wno-unused-local-typedefs",
            "-fno-addrsig",
            "-fcommon",
            "-fsanitize=kernel-address",
            "main.cc"
          ],
          "path": "/tmp/stable/clang"
        }
      }
    ],
    "wd": "/tmp/stable",
    "wrapper": {
      "cmd": {
        "args": [
          "-fsanitize=kernel-address",
          "-D_FORTIFY_SOURCE=2",
          "main.cc"
        ],
        "path": "./x86_64-cros-linux-gnu-clang"
      }
    }
  },
  {
    "cmds": [
      {
        "cmd": {
          "args": [
            "-Qunused-arguments",
            "-Werror=poison-system-directories",
            "-Wno-deprecated-declarations",
            "-Wno-enum-constexpr-conversion",
            "-Wno-error=implicit-function-declaration",
            "-Wno-error=implicit-int",
            "-Wno-final-dtor-non-final-class",
            "-Wno-single-bit-bitfield-constant-conversion",
            "-Wno-tautological-constant-compare",
            "-Wno-tautological-unsigned-enum-zero-compare",
            "-Wno-unknown-warning-option",
            "-fdebug-default-version=5",
            "-Wno-int-conversion",
            "-Wno-incompatible-function-pointer-types",
            "-Wno-error=vla-cxx-extension",
            "-D_LIBCPP_ENABLE_CXX17_REMOVED_FEATURES",
            "-fclang-abi-compat=17",
            "-Wno-unused-local-typedefs",
            "-fno-addrsig",
            "-fcommon",
            "-fsanitize=fuzzer",
            "main.cc"
          ],
          "path": "/tmp/stable/clang"
        }
      }
    ],
    "wd": "/tmp/stable",
    "wrapper": {
      "cmd": {
        "args": [
          "-fsanitize=fuzzer",
          "main.cc"
        ],
        "path": "./x86_64-cros-linux-gnu-clang"
      }
    }
  },
  {
    "cmds": [
      {
        "cmd": {
          "args": [
            "-Qunused-arguments",
            "-Werror=poison-system-directories",
            "-Wno-deprecated-declarations",
            "-Wno-enum-constexpr-conversion",
            "-Wno-error=implicit-function-declaration",
            "-Wno-error=implicit-int",
            "-Wno-final-dtor-non-final-class",
            "-Wno-single-bit-bitfield-constant-conversion",
            "-Wno-tautological-constant-compare",
            "-Wno-tautological-unsigned-enum-zero-compare",
            "-Wno-unknown-warning-option",
            "-fdebug-default-version=5",
            "-Wno-int-conversion",
            "-Wno-incompatible-function-pointer-types",
            "-Wno-error=vla-cxx-extension",
            "-D_LIBCPP_ENABLE_CXX17_REMOVED_FEATURES",
            "-fclang-abi-compat=17",
            "-Wno-unused-local-typedefs",
            "-fno-addrsig",
            "-fcommon",
            "-fsanitize=address",
            "-fprofile-instr-generate",
            "main.cc"
          ],
          "path": "/tmp/stable/clang"
        }
      }
    ],
    "wd": "/tmp/stable",
    "wrapper": {
      "cmd": {
        "args": [
          "-fsanitize=address",
          "-fprofile-instr-generate",
          "main.cc"
        ],
        "path": "./x86_64-cros-linux-gnu-clang"
      }
    }
  },
  {
    "cmds": [
      {
        "cmd": {
          "args": [
            "-Qunused-arguments",
            "-Werror=poison-system-directories",
            "-Wno-deprecated-declarations",
            "-Wno-enum-constexpr-conversion",
            "-Wno-error=implicit-function-declaration",
            "-Wno-error=implicit-int",
            "-Wno-final-dtor-non-final-class",
            "-Wno-single-bit-bitfield-constant-conversion",
            "-Wno-tautological-constant-compare",
            "-Wno-tautological-unsigned-enum-zero-compare",
            "-Wno-unknown-warning-option",
            "-fdebug-default-version=5",
            "-Wno-int-conversion",
            "-Wno-incompatible-function-pointer-types",
            "-Wno-error=vla-cxx-extension",
            "-D_LIBCPP_ENABLE_CXX17_REMOVED_FEATURES",
            "-fclang-abi-compat=17",
            "-Wno-unused-local-typedefs",
            "-fno-addrsig",
            "-fcommon",
            "-fsanitize=address",
            "main.cc"
          ],
          "path": "/tmp/stable/clang"
        }
      }
    ],
    "wd": "/tmp/stable",
    "wrapper": {
      "cmd": {
        "args": [
          "-fsanitize=address",
          "main.cc"
        ],
        "path": "./x86_64-cros-linux-gnu-clang"
      }
    }
  },
  {
    "cmds": [
      {
        "cmd": {
          "args": [
            "-Qunused-arguments",
            "-Werror=poison-system-directories",
            "-Wno-deprecated-declarations",
            "-Wno-enum-constexpr-conversion",
            "-Wno-error=implicit-function-declaration",
            "-Wno-error=implicit-int",
            "-Wno-final-dtor-non-final-class",
            "-Wno-single-bit-bitfield-constant-conversion",
            "-Wno-tautological-constant-compare",
            "-Wno-tautological-unsigned-enum-zero-compare",
            "-Wno-unknown-warning-option",
            "-fdebug-default-version=5",
            "-Wno-int-conversion",
            "-Wno-incompatible-function-pointer-types",
            "-Wno-error=vla-cxx-extension",
            "-D_LIBCPP_ENABLE_CXX17_REMOVED_FEATURES",
            "-fclang-abi-compat=17",
            "-Wno-unused-local-typedefs",
            "-fno-addrsig",
            "-fcommon",
            "-fprofile-instr-generate",
            "main.cc"
          ],
          "path": "/tmp/stable/clang"
        }
      }
    ],
    "wd": "/tmp/stable",
    "wrapper": {
      "cmd": {
        "args": [
          "-fprofile-instr-generate",
          "main.cc"
        ],
        "path": "./x86_64-cros-linux-gnu-clang"
      }
    }
  }
]
