; ModuleID = 'probe3.971c5a3bb38f7b08-cgu.0'
source_filename = "probe3.971c5a3bb38f7b08-cgu.0"
target datalayout = "e-m:e-p270:32:32-p271:32:32-p272:64:64-i64:64-f80:128-n8:16:32:64-S128"
target triple = "x86_64-unknown-linux-gnu"

!llvm.module.flags = !{!0, !1}
!llvm.ident = !{!2}

!0 = !{i32 8, !"PIC Level", i32 2}
!1 = !{i32 2, !"RtLibUseGOT", i32 1}
!2 = !{!"rustc version 1.74.1-dev (a28077b28 2023-12-04) (Android Rust Toolchain version linux-11359135)"}
