{
  "apex_available": [
    "//apex_available:platform",
    "com.android.uwb"
  ],
  "min_sdk_version": "29",
  "tests": true,
  "package": {
    "jni": {
      "patch": "patches/Android.bp.diff"
    }
  }
}
