{
  "requireLibs": [
    "libdexfiled.so",
    "libjdwp.so",
    // TODO(b/120786417 or b/134659294): libicuuc.so
    // and libicui18n.so are kept for app compat.
    "libicui18n.so",
    "libicuuc.so"
  ],
  "provideLibs": [
    "libaptX_encoder.so",
    "libaptXHD_encoder.so"
  ]
}
