568351 112880
204645 441039
142703 972427
705983 542614
700277 339711
964853 434479
799454 436130
396007 394609
698471 15635
672381 401919
243918 705255
207836 368464
751920 208759
612017 730914
815451 548709
788050 144688
241079 196376
964907 451498
55292 542459
467123 315768
700962 38617
943660 492017
410405 631118
406640 716477
410258 291429
798421 43932
208663 416436
127836 766345
901273 852309
295086 990427
530420 243526
122920 14766
410962 413752
944310 251555
462354 945380
870049 246663
826436 431099
183421 663591
991888 662926
786852 76022
720147 792147
662503 514530
835619 872624
158992 368754
913238 402966
239505 16742
186340 974072
329117 882387
943332 591340
437476 956079
429446 400553
219575 611247
690231 388845
148578 873543
818116 195467
395435 468348
214694 476907
132060 338470
669270 697862
926210 634272
422560 688506
788824 308138
613412 779312
790005 534464
682221 27851
366354 598713
916622 632279
147415 369262
58611 14188
22419 275768
114149 925383
438293 442925
94980 767739
144371 954487
273449 549502
447496 915056
895892 209150
807823 550
78154 422520
837339 574129
161337 462950
524211 433007
420382 584279
698424 204807
134560 687973
506926 865454
570793 673407
502116 826160
126380 493242
126236 178884
910370 901817
471438 528910
675440 198089
142774 142048
874294 562412
469787 575799
607297 321303
910957 822929
441054 466575
278951 958050
103828 882593
710601 340311
784608 620590
301097 684807
928447 120572
913861 518657
416325 847804
325689 18116
660757 480005
339283 463457
983499 22223
878481 425548
459208 74334
659416 130683
36075 519271
215382 793113
89723 472952
243736 982299
548545 446756
480183 280467
944904 747974
265257 785421
215039 808211
354603 487545
315151 503771
134266 730950
11672 453328
236334 479368
313386 628138
882226 118509
460261 217988
393264 256223
290762 54988
445509 624654
221389 897438
803625 419166
82852 632667
325768 136545
972752 55857
817102 668188
146747 35084
186255 140512
220310 967281
350010 691818
683790 249075
381368 283509
59828 837365
89899 959418
922348 670903
463077 37487
699833 511083
67245 291618
997798 844996
617873 652992
222232 216380
215067 356030
870127 215253
285089 482340
304742 460824
267845 434441
308065 218265
473972 16627
400993 986173
663505 33394
298372 412627
421390 919176
541180 719114
645050 52266
636404 779975
908130 853276
66496 385584
583146 801985
934629 618311
125636 347621
910871 416065
602540 487322
110273 253040
233892 287414
222353 787888
41016 729366
911868 691866
348011 918133
919133 33192
909316 57498
52565 887550
366741 540909
181541 761092
133004 369181
192650 100513
621576 928969
511186 883878
270650 726752
714330 65084
681872 297516
204386 244395
495348 624175
986415 150064
54251 562950
764288 448264
430776 590104
808989 252803
141899 400812
