837610 372177 509
554229 877043 525
169325 458045 449
10610 538256 470
788473 904283 525
374336 190381 443
671347 303595 509
524358 458376 470
980279 417408 525
244018 108081 443
310400 644787 509
876413 778773 525
432318 524772 470
161080 308615 443
860515 606288 525
296586 993151 525
860885 473768 525
682879 926326 525
240876 327804 407
703513 346025 509
856114 136381 525
369021 767362 509
535534 356933 470
711407 532615 509
990252 930610 507
874988 806406 525
291282 113039 443
170601 123532 383
317585 1070 443
762033 779845 468
106665 854148 525
188530 315171 443
439239 456187 387
143944 547350 470
662098 353414 509
45826 366625 443
419618 517638 470
77276 4800 351
70772 130395 354
731942 714358 411
117796 456946 449
867584 324889 525
14281 992835 525
329974 788482 509
48792 141399 354
773943 463752 509
878693 558560 525
207987 600781 470
482563 401876 449
341133 549072 470
238012 238473 306
771194 741373 468
425231 768110 509
695979 226600 509
19207 381382 443
769503 786371 437
808193 84054 509
779 103554 351
868939 634575 525
251484 944644 525
466107 900047 525
855234 359073 525
93525 985339 525
277393 121579 443
345993 957216 525
335683 115809 443
696641 775004 504
410250 49042 449
374092 77603 443
962511 308199 525
487500 505993 426
16566 51181 324
674684 403345 509
367766 277302 441
576512 157526 470
69740 762345 509
938323 284954 525
185233 747299 509
363766 869084 525
337921 743644 509
566988 784189 509
984203 474355 525
596072 261895 470
975699 201615 525
746041 123180 509
170660 709492 509
549351 731950 509
801008 179902 509
996063 407551 525
582740 555359 421
18753 534765 470
248450 894470 525
239936 228239 443
862911 982590 507
156839 775765 509
456141 419525 418
237995 243581 368
782357 805347 468
734804 393127 509
96973 998940 525
598783 118704 470
829973 228184 509
733482 233663 509
470581 127693 449
928290 854694 476
909060 488142 525
854652 978251 507
801405 5647 509
503728 923588 525
798014 580412 509
908073 32299 525
114402 269107 443
801829 186625 509
473292 437408 444
148344 766964 509
799478 79278 509
794163 717013 468
571723 487659 470
980425 310887 525
620322 683656 509
422218 398785 449
881270 542309 525
47428 84261 351
862960 129477 525
194797 86626 383
543573 553861 452
61469 485108 449
378560 859745 525
35072 63763 340
40798 529611 470
608579 514201 452
99397 588879 470
233343 327394 407
20065 784570 509
184500 368323 443
86716 329592 443
135782 666309 509
357426 583121 470
542838 991280 525
730375 423904 509
816755 703517 504
796731 364048 509
542385 99929 470
47506 947404 525
652070 389274 509
389593 14189 443
632203 637273 416
999692 768971 525
182932 637186 509
830575 990850 525
316119 11528 443
431283 468321 444
973611 406624 525
230590 306341 443
169295 477973 449
433250 374175 449
29004 213780 383
524013 547054 452
84097 775146 509
328883 498378 449
256005 419061 449
887518 651987 525
480707 772148 509
327227 185423 443
402876 155143 443
171632 481496 449
829021 934899 525
871314 95888 525
105674 577215 470
541268 193439 470
712292 316544 509
480325 338573 449
177293 755039 509
307140 184478 443
468245 347324 449
392003 154451 443
46341 181319 383
271201 726470 509
512948 928172 525
395400 13384 443
637066 676270 442
785453 135860 509
350113 636541 509
158886 900115 525
449612 479642 444
796834 237080 509
260110 12207 443
979144 30366 525
330986 971665 525
296622 411643 449
351392 884165 525
814964 535529 509
232873 911514 525
934364 721233 525
83565 307406 443
551338 728177 509
731003 636400 504
872442 598404 525
294195 733645 509
491886 533145 470
182109 828597 509
522698 492843 470
943261 806542 525
253147 674653 509
490773 672908 509
771247 732348 468
102405 242545 443
52730 664730 509
924191 555040 525
762001 282850 509
261174 788832 509
782394 702799 504
327006 10176 443
330134 888595 525
655393 377750 509
181794 376143 443
593085 165410 470
345317 335040 366
201548 494648 449
179731 957919 525
816098 340064 509
72835 518508 470
328135 963631 525
131789 665147 509
193902 628041 509
676523 888239 525
669518 909754 525
475361 45815 449
675369 974971 525
322059 892635 525
988745 842282 507
987424 987524 352
488053 489588 382
502592 178747 449
915068 169519 525
210004 573420 470
553730 120316 470
265360 474646 449
35345 555091 470
959037 711073 525
182406 904534 525
799668 79218 509
230117 447957 449
188139 406236 443
931613 881968 476
167568 290742 443
620057 348699 470
394034 395895 405
747214 821422 468
407177 949851 525
213589 970120 525
623367 279499 470
7734 320172 443
801827 333429 509
217956 484295 449
377080 502118 449
595565 404372 470
520902 987017 525
656890 467540 509
299706 520175 470
408272 513591 470
306612 535485 470
324708 384868 441
864831 765764 525
387109 596963 470
311543 937410 525
27684 46496 324
486710 573174 470
86535 92263 333
624096 485353 470
