744784 822178 468
967183 662839 525
115285 651526 509
144659 526395 470
896762 229789 525
120400 802758 509
626679 184397 509
779113 782002 362
212915 742110 509
465760 332447 449
575277 846062 525
269493 931612 525
22435 890874 525
471206 940168 525
206315 749438 509
874922 943071 507
68058 822717 509
416314 939291 525
554284 523953 452
402719 275957 441
521768 676912 509
534601 351384 470
160905 835591 509
264070 125312 443
773436 597264 509
609219 776501 509
319636 571932 470
783214 128793 509
745832 502492 509
511688 443131 444
256712 169145 443
784731 413227 509
41253 585211 470
625508 373281 470
712084 969375 525
514769 746398 509
265997 388384 441
132909 947614 525
213407 432492 449
93184 311709 443
707355 566382 509
336546 731675 509
627482 192450 509
933198 113051 525
550897 853415 525
245606 186593 443
982856 124812 525
927639 902800 476
969563 539266 525
938176 764599 525
12489 112196 354
815589 377951 509
675249 171829 509
618635 762239 509
458305 547081 470
697364 963984 525
828447 906721 525
486833 3865 449
71533 910426 525
540354 290171 470
750922 205796 509
986673 209228 525
66768 34499 340
986405 630302 525
716125 429868 509
917499 656179 525
312278 405237 441
569322 684924 509
566652 287991 470
155946 774261 509
329839 959537 525
893196 962172 507
223351 131073 386
885618 190473 525
963273 15325 525
284435 229975 443
607614 941030 525
33698 233442 443
918485 221239 525
729706 450363 509
748164 458623 509
925616 265409 525
101843 367630 443
759703 606766 509
71414 958527 525
758071 41659 509
699460 537009 509
578686 568621 390
372529 91954 443
516430 231260 470
775575 785194 437
280941 623011 470
13661 178104 383
603414 317376 470
144175 737392 509
862027 723062 525
775360 379194 509
495067 919413 525
457787 906096 525
296342 654314 509
958393 652338 525
611339 509232 470
624356 36795 470
877462 254831 525
92920 144314 375
810287 544928 509
602149 79942 470
905988 850845 445
54486 366017 443
588084 866795 525
164479 526098 470
337670 850171 525
755948 921484 525
145135 289970 443
82511 201996 383
793035 544484 509
353497 970103 525
86089 791791 509
787367 341893 509
338571 598396 470
471570 801996 509
586341 445259 470
551184 331009 470
14653 189552 383
963280 712892 525
313823 862482 525
406517 696380 509
941510 59788 525
385699 434609 449
32745 399691 443
766291 13611 509
998255 826570 525
429038 492679 444
3748 673765 509
427600 753534 509
38894 261359 443
246052 474944 449
44948 374016 443
770944 902499 525
783789 417179 509
301898 484046 449
800508 168784 509
96273 894743 525
724156 338239 509
889391 910594 476
980650 436357 525
872816 89430 525
15177 344024 443
153641 753133 509
656466 8394 509
810396 76895 509
662680 445257 509
603328 796026 509
653454 210644 509
99583 988475 525
545872 201424 470
547995 833156 509
756496 777245 468
485773 315995 449
588219 680261 509
779875 698828 504
279969 248422 407
475460 258295 449
160358 185392 370
705992 717690 411
218801 796906 509
372134 350249 410
722393 415937 509
35814 517908 470
568531 117297 470
334737 412206 449
347310 934736 525
826177 586801 509
58960 368706 443
985990 444100 525
124678 112950 349
300845 21573 443
263290 51712 443
757808 273468 509
542960 307609 470
825085 374756 509
322286 269400 407
879837 182756 525
210577 639234 509
200646 256601 443
818343 798460 406
898152 793394 525
752919 623765 509
441358 919799 525
181221 671749 509
569030 420968 470
605468 178577 470
728397 571433 509
850431 32788 525
190375 549122 470
640066 729155 504
165766 944393 525
701833 710227 504
315791 940372 525
292371 47356 443
396959 252741 441
668111 891456 525
246358 244496 319
697868 259517 509
964270 879897 507
321229 617884 470
541816 411425 470
323544 999387 525
247730 982366 525
663685 153139 509
59829 582166 470
638244 662311 429
119346 891538 525
77659 382937 443
775262 343800 509
437064 37708 449
450813 452476 307
963657 304504 525
248758 363403 441
610549 357159 470
820665 694535 504
866270 296500 525
926560 458682 525
597151 981580 525
191592 367535 443
498009 808510 509
710447 915344 525
493670 86979 449
242516 938220 525
62097 489875 449
519275 601350 452
877650 419954 525
