28400 590674 470
849218 421023 525
760762 579131 509
952810 885688 507
347883 724839 509
300734 355387 441
856946 148838 525
46899 888534 525
558023 141082 470
394591 369091 436
830932 834545 419
526195 422602 470
823769 147689 509
660577 657256 398
458701 495610 444
768458 718646 468
516105 840258 525
480016 274369 449
831702 407704 509
76223 969788 525
520538 898940 525
858965 802845 525
103189 32777 351
601784 560321 434
470973 684253 509
849550 618032 525
240263 61535 443
545959 423693 470
711998 336649 509
493158 604280 470
23364 232876 443
229212 785034 509
490228 50583 449
966611 558884 525
621566 925111 525
289933 819047 509
363025 475608 449
682548 110860 509
249530 914417 525
680143 416950 509
169791 247223 443
381883 627835 509
379062 190577 443
940675 191632 525
509988 543672 470
719794 931823 525
169981 274299 443
46613 610594 470
113456 567835 470
236336 487698 449
760367 100237 509
900385 876948 445
98139 865491 525
728798 961302 525
857572 865434 388
100120 756199 509
342040 233960 407
143875 882484 525
451867 198230 449
709816 991926 525
933716 874458 476
473955 544285 470
916645 748840 525
167933 14011 383
928604 798226 525
171703 855099 525
952358 920774 507
424994 352933 449
896052 490489 525
961328 60061 525
462957 660342 509
129450 964445 525
280606 43617 443
408278 904325 525
322338 706700 509
165097 91870 383
40007 832682 509
643531 875636 525
610695 464872 470
318357 568062 470
34152 244208 443
11413 920035 525
400662 921965 525
383020 197255 443
774713 449342 509
31699 456385 449
623345 531789 452
709633 872664 525
68842 925047 525
793400 931411 525
923207 847026 476
566307 426702 470
13868 343557 443
244839 942323 525
977103 657284 525
449441 495648 444
501472 912164 525
201924 294251 443
325054 744905 509
368258 644728 509
109388 809709 509
101354 283296 443
168525 916987 525
893628 243812 525
267401 110072 443
772011 723779 468
610836 706962 509
442575 672654 509
229966 115472 386
516322 974653 525
975761 111317 525
42783 295695 443
105070 972840 525
66052 400908 443
561930 158497 470
467375 297783 449
466161 153359 449
568218 856698 525
195378 722717 509
538640 984941 525
672849 79513 509
180854 538367 470
526220 593009 452
454894 291291 449
872197 110336 525
495378 189553 449
724743 700829 504
636619 732959 504
942518 965899 414
157990 338204 443
673229 348455 509
752759 527380 509
611237 663591 509
184020 201891 360
47999 215408 383
930797 835733 525
321786 289561 384
361810 290222 441
906681 963847 507
904287 603642 525
301571 80697 443
626305 282126 470
443948 78333 449
342314 637924 509
914066 521758 525
115561 240563 443
828012 920714 525
33904 878025 525
731169 559878 509
23050 506716 449
919532 240380 525
667900 178021 509
13096 130719 354
106307 493831 449
107477 791189 509
243298 666331 509
981327 587308 525
34416 173035 383
581551 392536 470
78727 428577 449
125174 12385 354
550867 966195 525
985188 683863 525
586038 617920 447
807301 897512 525
183783 783336 509
667291 637217 442
909822 256983 525
127565 454584 449
543307 640727 509
567090 21836 470
887968 310206 525
161095 298398 443
353522 570916 470
297706 210668 443
221030 194032 386
820954 197773 509
875083 217125 525
130057 539486 470
593752 142494 470
519107 313170 470
92152 495993 449
730280 965024 525
130774 18746 354
721718 309702 509
420268 861027 525
992469 874519 507
562091 992795 525
631455 255041 509
410603 945494 525
485705 628455 509
925585 819846 525
161976 759452 509
453705 358706 449
532079 568537 452
910008 320974 525
120064 150933 375
30755 267890 443
44497 476048 449
340195 398018 441
992248 302691 525
566159 994742 525
122404 456192 449
844510 114966 525
537224 810014 509
809777 565257 509
88305 269660 443
681511 832319 504
656369 658278 429
405770 260870 441
474179 975452 525
405890 561502 470
114837 199061 383
695307 590365 509
808701 51980 509
896222 188835 525
973105 474574 525
568986 107848 470
717907 716387 349
922223 112396 525
753055 419320 509
76377 985459 525
808109 85064 509
626652 116322 509
362408 210997 443
877987 175958 525
41700 759752 509
898084 445325 525
414459 404462 449
904310 619633 525
55110 985943 525
101658 649762 509
549534 681793 509
88289 838138 525
271237 85318 443
547546 283705 470
193959 351216 443
490594 654112 509
28508 463893 449
838346 276829 525
855686 316865 525
145994 148832 357
921464 880373 476
626414 707347 504
931022 659362 525
194842 595845 470
