827145 780707
965794 186944
528632 234451
502202 73517
413149 735404
662130 333395
593191 186040
750770 730891
95991 283309
136357 348639
73041 20661
705365 766436
274455 605131
530512 410651
168034 886107
818802 804859
711831 483110
796485 405095
798555 263519
940151 486165
22799 54978
696598 412934
99119 10186
911964 188391
927735 205365
926663 897479
301562 355418
844706 622677
406816 272750
887729 673638
421530 295013
316443 121522
903477 147357
259649 215126
709819 265937
693902 288911
489114 414004
26203 268869
412856 753104
588259 184581
108966 624364
412449 205275
973015 687556
744833 142931
501491 343424
467988 161103
675318 147087
828529 110042
54089 371947
414502 802895
714691 793961
517697 958055
316549 187382
486785 685538
699859 233040
140852 735888
537181 645392
87275 602532
910261 41129
617692 330884
561604 803406
884419 820682
810770 351989
245616 908050
437469 898416
441793 187250
71701 851474
141063 428089
160540 456953
335592 344070
915023 125341
25468 245528
226064 1356
318398 916008
111364 119632
821643 52552
173415 7500
467338 665596
39189 78403
652376 195587
810219 709760
436568 769589
816829 219726
952677 561773
985816 1032
124361 294381
704391 613564
278948 104035
261121 942785
7968 12164
104522 806776
54070 824310
466972 97393
289716 211660
103251 344448
257638 696319
363383 285839
647465 417885
188957 156342
756950 416656
255201 119638
228120 705935
823399 318564
95978 440008
36534 333954
123849 898381
922038 222021
830688 403577
804227 449139
686393 250256
424493 726170
465134 409047
425273 625978
647821 750699
623664 700869
13961 949356
894829 43302
862199 71452
685687 734574
313240 871632
21982 413297
824641 640400
569274 961861
202979 252511
888871 363191
470732 733679
10111 928016
227315 431461
951561 27980
632382 927359
154957 400711
917261 415772
756887 632402
613200 464821
755709 722138
89661 966271
579144 708412
688451 174695
934424 144859
888055 136579
533398 351537
594742 604154
559930 487251
585304 411347
439789 852146
239855 341681
552314 365962
592906 725505
701244 510154
492735 147688
297310 983856
86028 805212
493282 667074
167166 261852
402014 225931
174377 640279
233553 615388
910456 11624
842013 592771
501552 880131
943432 18335
361332 790849
664295 689627
225152 256201
497944 23444
911686 715052
15684 448254
421760 192320
40100 552196
821056 382108
709596 490265
637815 664835
810858 703508
528164 455197
325375 332696
390692 854236
114514 346381
165220 410057
637004 167328
483153 382687
279731 969136
379093 591434
895618 861716
384567 583888
873031 181785
587192 745015
147794 46665
648177 717644
887825 706763
237732 869768
931019 963109
792111 703804
607175 4329
675805 608438
961773 59529
862628 371546
560841 114627
558616 114482
707598 155992
384687 251051
618361 275220
657736 187404
269480 178865
13722 51544
354678 630946
922196 818817
724174 202468
144792 140355
989471 54372
930632 134337
177942 480954
718186 123393
295903 954968
329092 592244
129171 247352
869926 815150
227974 548081
883896 870457
150727 455254
957558 288991
970016 829271
635769 690138
714723 650648
92255 742036
896879 682102
209884 397864
507541 145333
66378 416473
518835 738670
876816 225278
848957 533058
132045 486286
565846 294971
614096 246398
408858 859304
567018 649851
161175 327612
846638 234577
683037 117259
684927 446763
417049 717132
378180 77682
22635 39091
702262 446568
439823 337396
124594 770020
156823 979323
132867 204497
928077 338036
420266 480700
739264 414058
848000 976500
699915 192319
924252 153636
292475 142454
707078 942735
171349 366829
727377 239942
385326 15098
476004 500126
965130 830944
138886 463624
213900 262097
997879 665202
