{
  "containerDefinitions": [
    {
      "memory": 400,
      "portMappings": [
        {
          "hostPort": 0,
          "containerPort": 5000,
          "protocol": "tcp"
        }
      ],
      "essential": true,
      "name": "nodejs",
      "image": "anuphnu/nodejstest:TAG_VAR",
      "logConfiguration": {
       "logDriver": "awslogs",
        "options": {
          "awslogs-group": "FAMILY_VAR",
          "awslogs-region": "us-east-2",
          "awslogs-stream-prefix": "TAG"
        }
      },
      "cpu": 500,
      "memoryReservation": 300
    }
  ],
  "family": "FAMILY_VAR"
}

