<<<<<<< HEAD
<<<<<<< HEAD
anuj singh 
||||||| merged common ancestors
anuj 
=======
anuj singh chauhan 
>>>>>>> feature-2
||||||| merged common ancestors
anuj 
=======
anuj singh chauhan 
>>>>>>> feature-2



