// Jest Snapshot v1, https://goo.gl/fbAQLP

exports[`AnalysisTypesComponent should render properly 1`] = `
<div
  className="container"
>
  <div
    className="page-header"
  >
    <h1>
      Analysetyper
    </h1>
  </div>
  <div
    className="row"
  >
    <div
      className="col-sm-2"
      style={
        Object {
          "textAlign": "right",
        }
      }
    >
      <label>
        Nytt analysetypenavn
      </label>
    </div>
    <div
      className="col-sm-3"
    >
      <input
        className="form-control"
        type="text"
      />
    </div>
    <div
      className="col-sm-7"
    >
      <button
        className="btn btn-default"
        type="button"
      >
        Legg til analysetype
      </button>
    </div>
  </div>
  <table
    className="table"
  >
    <thead>
      <tr>
        <th>
          Name
        </th>
        <th
          style={
            Object {
              "textAlign": "center",
            }
          }
        >
          Alger
        </th>
        <th
          style={
            Object {
              "textAlign": "center",
            }
          }
        >
          Arkeologi
        </th>
        <th
          style={
            Object {
              "textAlign": "center",
            }
          }
        >
          Entomologi
        </th>
        <th
          style={
            Object {
              "textAlign": "center",
            }
          }
        >
          Etnografi
        </th>
        <th
          style={
            Object {
              "textAlign": "center",
            }
          }
        >
          Karplanter
        </th>
        <th
          style={
            Object {
              "textAlign": "center",
            }
          }
        >
          Lav
        </th>
        <th
          style={
            Object {
              "textAlign": "center",
            }
          }
        >
          Marine evertebrater
        </th>
        <th
          style={
            Object {
              "textAlign": "center",
            }
          }
        >
          Mose
        </th>
        <th
          style={
            Object {
              "textAlign": "center",
            }
          }
        >
          Numismatikk
        </th>
        <th
          style={
            Object {
              "textAlign": "center",
            }
          }
        >
          Sopp
        </th>
      </tr>
    </thead>
    <tbody>
      <tr>
        <td>
          3D-skanning, laser
        </td>
        <td
          style={
            Object {
              "textAlign": "center",
            }
          }
        >
          <input
            checked={1}
            type="checkbox"
            value=""
          />
        </td>
        <td
          style={
            Object {
              "textAlign": "center",
            }
          }
        >
          <input
            checked={1}
            type="checkbox"
            value=""
          />
        </td>
        <td
          style={
            Object {
              "textAlign": "center",
            }
          }
        >
          <input
            checked={1}
            type="checkbox"
            value=""
          />
        </td>
        <td
          style={
            Object {
              "textAlign": "center",
            }
          }
        >
          <input
            checked={1}
            type="checkbox"
            value=""
          />
        </td>
        <td
          style={
            Object {
              "textAlign": "center",
            }
          }
        >
          <input
            checked={1}
            type="checkbox"
            value=""
          />
        </td>
        <td
          style={
            Object {
              "textAlign": "center",
            }
          }
        >
          <input
            checked={1}
            type="checkbox"
            value=""
          />
        </td>
        <td
          style={
            Object {
              "textAlign": "center",
            }
          }
        >
          <input
            checked={1}
            type="checkbox"
            value=""
          />
        </td>
        <td
          style={
            Object {
              "textAlign": "center",
            }
          }
        >
          <input
            checked={1}
            type="checkbox"
            value=""
          />
        </td>
        <td
          style={
            Object {
              "textAlign": "center",
            }
          }
        >
          <input
            checked={1}
            type="checkbox"
            value=""
          />
        </td>
        <td
          style={
            Object {
              "textAlign": "center",
            }
          }
        >
          <input
            checked={1}
            type="checkbox"
            value=""
          />
        </td>
        <td>
          <button
            className="btn btn-default"
            type="button"
            value={1}
          >
            <FontAwesome
              name="pencil-square-o"
            />
          </button>
        </td>
      </tr>
      <tr>
        <td>
          3D-skanning, strukturert lys
        </td>
        <td
          style={
            Object {
              "textAlign": "center",
            }
          }
        >
          <input
            checked={1}
            type="checkbox"
            value=""
          />
        </td>
        <td
          style={
            Object {
              "textAlign": "center",
            }
          }
        >
          <input
            checked={1}
            type="checkbox"
            value=""
          />
        </td>
        <td
          style={
            Object {
              "textAlign": "center",
            }
          }
        >
          <input
            checked={1}
            type="checkbox"
            value=""
          />
        </td>
        <td
          style={
            Object {
              "textAlign": "center",
            }
          }
        >
          <input
            checked={1}
            type="checkbox"
            value=""
          />
        </td>
        <td
          style={
            Object {
              "textAlign": "center",
            }
          }
        >
          <input
            checked={1}
            type="checkbox"
            value=""
          />
        </td>
        <td
          style={
            Object {
              "textAlign": "center",
            }
          }
        >
          <input
            checked={1}
            type="checkbox"
            value=""
          />
        </td>
        <td
          style={
            Object {
              "textAlign": "center",
            }
          }
        >
          <input
            checked={1}
            type="checkbox"
            value=""
          />
        </td>
        <td
          style={
            Object {
              "textAlign": "center",
            }
          }
        >
          <input
            checked={1}
            type="checkbox"
            value=""
          />
        </td>
        <td
          style={
            Object {
              "textAlign": "center",
            }
          }
        >
          <input
            checked={1}
            type="checkbox"
            value=""
          />
        </td>
        <td
          style={
            Object {
              "textAlign": "center",
            }
          }
        >
          <input
            checked={1}
            type="checkbox"
            value=""
          />
        </td>
        <td>
          <button
            className="btn btn-default"
            type="button"
            value={2}
          >
            <FontAwesome
              name="pencil-square-o"
            />
          </button>
        </td>
      </tr>
    </tbody>
  </table>
</div>
`;
