<svg xmlns="http://www.w3.org/2000/svg" width="77.742" height="26.807" viewBox="0 0 77.742 26.807">
  <g id="wajywm" transform="translate(0 0)" opacity="0.357">
    <g id="Groupe_789" data-name="Groupe 789">
      <path id="Tracé_422" data-name="Tracé 422" d="M486.576,621.712a.8.8,0,0,1,.378.612c.1.593.217,1.183.33,1.774a1,1,0,0,0,.06.165,7.8,7.8,0,0,1,1.069-.488,1.318,1.318,0,0,1,1.646.838,11.53,11.53,0,0,1,.313,1.768c.074.505.112,1.015.179,1.522a.349.349,0,0,1-.327.436c-.319.058-.563-.09-.587-.368-.052-.611-.065-1.227-.14-1.835a6.349,6.349,0,0,0-.291-1.336c-.151-.426-.446-.487-.847-.265a1.48,1.48,0,0,0-.792,1.706c.1.583.175,1.169.24,1.756.038.339-.123.528-.422.538s-.424-.181-.456-.453c-.131-1.119-.244-2.241-.4-3.357-.105-.757-.263-1.508-.41-2.258-.1-.5-.1-.523.325-.755Z" transform="translate(-463.009 -621.712)"/>
      <path id="Tracé_423" data-name="Tracé 423" d="M154.176,675.164l-4.273,2.319c-.086-.121-.167-.236-.248-.35a2.725,2.725,0,0,0-2.9-1.162,6.6,6.6,0,0,0-3.107,1.341,2.8,2.8,0,0,0-.65.814.981.981,0,0,0,.479,1.48,4.816,4.816,0,0,0,1.215.38c1.9.347,3.8.638,5.692,1.009a11.223,11.223,0,0,1,3.5,1.213,4.828,4.828,0,0,1,2.615,3.766,5.488,5.488,0,0,1-1.126,3.888,11.326,11.326,0,0,1-4.937,3.721A14.289,14.289,0,0,1,144,694.7a8.053,8.053,0,0,1-4.353-1.307,4.191,4.191,0,0,1-1.806-3.144,6.228,6.228,0,0,1,.456-3.214.361.361,0,0,1,.468-.26c1.553.271,3.111.517,4.666.772l.659.11c-.079.338-.171.641-.219.95a1.113,1.113,0,0,0,.636,1.25,2.992,2.992,0,0,0,2.019.266,7.083,7.083,0,0,0,3.279-1.447,2.108,2.108,0,0,0,.845-2.293,1.539,1.539,0,0,0-.941-1.081,12.293,12.293,0,0,0-2.158-.659c-2.347-.431-4.707-.793-7.059-1.2a5.393,5.393,0,0,1-2.661-1.141,3.212,3.212,0,0,1-1.065-2.843c.208-2.963,2.058-4.822,4.354-6.343a11.511,11.511,0,0,1,5.088-1.857,8.05,8.05,0,0,1,5.8,1.318A7.459,7.459,0,0,1,154.1,675,1.672,1.672,0,0,1,154.176,675.164Z" transform="translate(-136.755 -667.911)"/>
      <path id="Tracé_424" data-name="Tracé 424" d="M757.694,694.768c-.253.292-.491.56-.722.834-.489.579-.986,1.152-1.454,1.747a.455.455,0,0,1-.655.173c-1.907-.943-3.82-1.876-5.731-2.812-.086-.042-.17-.088-.306-.159a3.628,3.628,0,0,0-.038.381c.008.6.029,1.208.026,1.811,0,.1-.084.269-.162.291-1.148.323-2.3.625-3.5.945.021-.491.037-.945.067-1.4,0-.064.08-.127.128-.185a6.216,6.216,0,0,0,1.338-4.835,24.118,24.118,0,0,0-1.105-4.859,1.354,1.354,0,0,1-.047-.421c.019-1.218.049-2.437.061-3.655,0-.229.1-.306.3-.342a28.472,28.472,0,0,1,6.315-.521,10.754,10.754,0,0,1,3.44.659c3.192,1.232,3.158,4.292,1.74,6.214a9.191,9.191,0,0,1-3.341,2.621c-.711.365-1.454.67-2.183,1-.167.076-.336.147-.5.221-.006.035-.011.071-.017.106Zm-9.025-4.493a3.519,3.519,0,0,0,.36-.067c.732-.225,1.475-.425,2.192-.69a6.761,6.761,0,0,0,2.318-1.281,1.53,1.53,0,0,0,.572-1.038,1.591,1.591,0,0,0-1.3-1.662,7.836,7.836,0,0,0-3.518.026c-.483.078-.482.1-.5.583-.043,1.052-.086,2.1-.124,3.156C748.66,689.6,748.669,689.91,748.669,690.275Z" transform="translate(-704.993 -677.778)"/>
      <path id="Tracé_425" data-name="Tracé 425" d="M947.359,662.151c-.162.755-.316,1.479-.472,2.2-.146.674-.3,1.346-.437,2.022a.435.435,0,0,1-.45.405c-1.339.149-2.674.332-4.01.5-.945.119-1.891.242-2.838.342-.255.027-.342.125-.336.371.023.988.043,1.976.049,2.964,0,.247.109.3.323.276,1.108-.141,2.217-.279,3.325-.42.586-.075,1.172-.156,1.759-.23a1.414,1.414,0,0,1,.251.017c-.115.8-.225,1.576-.338,2.353-.079.541-.167,1.082-.236,1.624-.024.19-.071.294-.29.31-1.323.1-2.644.216-3.966.322-.363.029-.393.066-.337.419q.384,2.382.758,4.765c.018.117.015.238.023.382l-3.167.758c-.426.1-.854.2-1.278.306-.193.049-.26-.02-.27-.207-.064-1.193-.123-2.387-.2-3.579-.095-1.41-.21-2.819-.315-4.229-.074-.994-.155-1.989-.213-2.984a1.027,1.027,0,0,1,.139-.492,5.519,5.519,0,0,0,.714-2.639,4.487,4.487,0,0,0-1.232-3.138,1.183,1.183,0,0,1-.188-.6c-.007-.043.146-.154.235-.166,1.052-.144,2.107-.275,3.16-.411,1.292-.168,2.584-.34,3.877-.506q1.906-.245,3.814-.482.945-.12,1.891-.238C947.17,662.157,947.244,662.157,947.359,662.151Z" transform="translate(-881.487 -659.479)"/>
      <path id="Tracé_426" data-name="Tracé 426" d="M1102.466,674.085c-.032.258-.06.5-.092.733-.1.732.285,1.173,1.015,1.069a4.809,4.809,0,0,0,3.315-1.946,1.281,1.281,0,0,0-.737-2.137,9.477,9.477,0,0,0-2.011-.276c-.866-.047-1.737.009-2.6-.024a23.835,23.835,0,0,1-2.522-.2,2.518,2.518,0,0,1-2.131-2.481,11.964,11.964,0,0,1,.122-1.334.365.365,0,0,1,.374-.34c.391-.046.782-.1,1.174-.143a.455.455,0,0,0,.479-.419c.153-.839.352-1.67.542-2.5a.575.575,0,0,1,.164-.3,8.212,8.212,0,0,1,3.544-1.937,5.9,5.9,0,0,1,2.576.042,3.96,3.96,0,0,1,2.15,1.548c.306.385.589.787.9,1.208-.432.3-.826.576-1.22.85-.487.338-.983.664-1.46,1.016-.211.155-.349.134-.478-.079a.672.672,0,0,0-.062-.077,2.344,2.344,0,0,0-2.924-.835,8.669,8.669,0,0,0-1.392.789,1.02,1.02,0,0,0-.255.256,1.33,1.33,0,0,0-.315,1.4,1.194,1.194,0,0,0,1.218.623c1.087.024,2.176-.015,3.264.017a10.57,10.57,0,0,1,3.266.528,4.189,4.189,0,0,1,2.063,1.413,3.364,3.364,0,0,1,.341,3.408,7.406,7.406,0,0,1-3.212,3.555,9.754,9.754,0,0,1-4.408,1.4,6.761,6.761,0,0,1-3.067-.4,2.823,2.823,0,0,1-1.817-3.157,6.92,6.92,0,0,1,.242-1.186.389.389,0,0,1,.291-.221c.6,0,1.207.031,1.81.055S1101.815,674.056,1102.466,674.085Z" transform="translate(-1033.334 -659.08)"/>
      <path id="Tracé_427" data-name="Tracé 427" d="M420.776,756.274l2.73,6.275.1-.023c.138-.693.277-1.387.413-2.081.221-1.128.444-2.255.653-3.384a.3.3,0,0,1,.312-.3c.772-.094,1.541-.211,2.312-.313.25-.033.457-.069.552.3.971,3.8,1.966,7.587,2.952,11.38.077.294.273.651.173.871s-.5.312-.769.446c-.9.436-1.8.866-2.754,1.326l-1.576-6.272-.107-.008-1.527,5.41-3.247-5.343-.091.034c.043.449.081.9.129,1.347q.184,1.731.374,3.461c.058.533.116,1.067.185,1.6.048.377.022.431-.354.433-1.207.007-2.414,0-3.658,0a1.84,1.84,0,0,1,.273-1.36,6.507,6.507,0,0,0,1.423-3.037,5.412,5.412,0,0,0-1.54-4.944.97.97,0,0,1-.3-.7c-.022-1.186-.052-2.371-.061-3.557a.449.449,0,0,1,.179-.354c1.017-.409,2.044-.794,3.07-1.184A1,1,0,0,1,420.776,756.274Z" transform="translate(-398.85 -747.384)"/>
      <path id="Tracé_428" data-name="Tracé 428" d="M606.828,731.031c.317.988.637,1.929.92,2.882a13.974,13.974,0,0,1,.7,4.492,4.755,4.755,0,0,1-2.023,3.812,7.536,7.536,0,0,1-6.043,1.373.46.46,0,0,1-.4-.394c-.675-2.516-1.374-5.027-2.02-7.55a2.906,2.906,0,0,1,.109-1.182c.229-1.2.484-2.4.721-3.6.049-.252.148-.362.432-.357.813.017,1.626,0,2.439-.014.268-.005.345.05.266.339-.4,1.478-.822,2.953-1.156,4.447a8.042,8.042,0,0,0-.1,3.683,2.092,2.092,0,0,0,1.454,1.716,2.942,2.942,0,0,0,3.468-2.523,11.718,11.718,0,0,0-.754-3.881c-.182-.585-.4-1.16-.582-1.745-.03-.1,0-.295.062-.325C605.135,731.8,605.962,731.429,606.828,731.031Z" transform="translate(-567.486 -723.3)"/>
      <path id="Tracé_429" data-name="Tracé 429" d="M559.167,655.862a1.194,1.194,0,0,0,1.492.77,4.467,4.467,0,0,0,.74-.346c.078-.038.146-.115.227-.13a3.637,3.637,0,0,1,.457-.031c-.044.155-.039.385-.142.452a6.935,6.935,0,0,1-1.256.688,2.033,2.033,0,0,1-2.41-2.265,2.454,2.454,0,0,1,2.28-2.027,1.507,1.507,0,0,1,1.227.913.8.8,0,0,1-.29.853,4.194,4.194,0,0,1-1.892,1.017C559.465,655.795,559.327,655.824,559.167,655.862Zm.235-.71a3.212,3.212,0,0,0,1.415-.683c.153-.134.339-.283.2-.529a.553.553,0,0,0-.653-.329,2.106,2.106,0,0,0-1.326,1.192C558.94,655.032,559.01,655.168,559.4,655.152Z" transform="translate(-530.429 -650.908)"/>
      <path id="Tracé_430" data-name="Tracé 430" d="M438.5,628.806a.421.421,0,0,1,.449.407c.117.689.223,1.38.3,2.074.05.473.051.491.5.359a1.65,1.65,0,0,1,.634-.113c.146.019.272.2.408.3-.1.122-.178.311-.3.354-.308.1-.642.13-.959.213-.086.023-.214.145-.21.213.053.751.11,1.5.207,2.25.041.315.012.483-.234.547a.477.477,0,0,1-.58-.351c-.06-.411-.105-.825-.141-1.238-.034-.393-.034-.789-.079-1.18a.352.352,0,0,0-.233-.223c-.179-.04-.376,0-.555-.039-.1-.021-.238-.138-.24-.214a.374.374,0,0,1,.178-.3,1.64,1.64,0,0,1,.578-.074c.216,0,.312-.076.28-.287-.111-.732-.211-1.467-.345-2.2C438.083,628.948,438.143,628.81,438.5,628.806Z" transform="translate(-417.611 -628.336)"/>
      <path id="Tracé_431" data-name="Tracé 431" d="M798.372,741.137c0-.365-.009-.67,0-.975.037-1.052.081-2.1.124-3.156.02-.487.018-.5.5-.582a7.837,7.837,0,0,1,3.518-.026,1.591,1.591,0,0,1,1.3,1.662,1.529,1.529,0,0,1-.572,1.038,6.759,6.759,0,0,1-2.318,1.281c-.718.266-1.46.465-2.193.69A3.446,3.446,0,0,1,798.372,741.137Z" transform="translate(-754.696 -728.639)" fill="#fff"/>
      <path id="Tracé_432" data-name="Tracé 432" d="M569.946,663.781c-.392.016-.462-.12-.369-.349a2.105,2.105,0,0,1,1.326-1.192.553.553,0,0,1,.653.329c.143.246-.043.395-.2.529A3.212,3.212,0,0,1,569.946,663.781Z" transform="translate(-540.972 -659.537)" fill="#fff"/>
    </g>
  </g>
</svg>
