<svg xmlns="http://www.w3.org/2000/svg" width="56" height="56" viewBox="0 0 56 56">
  <g id="Composant_55_2" data-name="Composant 55 – 2" transform="translate(56 56) rotate(180)">
    <text id="_" data-name="↑" transform="translate(20 9)" fill="#fff" font-size="28" font-family="SupremeLLTT-Bold, Supreme LL TT" font-weight="700"><tspan x="0" y="28">↑</tspan></text>
    <g id="Ellipse_151" data-name="Ellipse 151" fill="none" stroke="#fff" stroke-width="3">
      <circle cx="28" cy="28" r="28" stroke="none"/>
      <circle cx="28" cy="28" r="26.5" fill="none"/>
    </g>
  </g>
</svg>
