<svg xmlns="http://www.w3.org/2000/svg" width="64.326" height="64.382" viewBox="0 0 64.326 64.382">
  <g id="nikon-7" opacity="0.357">
    <path id="Tracé_416" data-name="Tracé 416" d="M0,0H64.326V64.382H0Z" fill="#fff" fill-rule="evenodd"/>
    <path id="Tracé_417" data-name="Tracé 417" d="M50.408,80.334a3.824,3.824,0,0,0-2.586-2.228c-3.052-.815-6.918-.491-9.025,2.061a5.948,5.948,0,0,0-1.029,5.918A3.86,3.86,0,0,0,40.6,88.3c2.562.335,5.865.479,7.924-1.4a6.255,6.255,0,0,0,1.879-6.565Zm-6.319,4.72a1.167,1.167,0,0,1-1.018-.048c-.611-.336-.407-1.09-.336-1.594.287-.935.611-2.252,1.772-2.432a.959.959,0,0,1,1.018.575,3.689,3.689,0,0,1-1.436,3.5ZM16.323,72.648,14.168,78.9,12.53,72.648H8.178L2.834,87.917H7.919l2.026-5.822,1.508,5.822h4.611l5.343-15.269ZM24.755,77.2A2.942,2.942,0,0,0,27.089,75.9a2.161,2.161,0,0,0-.2-2.18,3.173,3.173,0,0,0-2.669-.743A2.576,2.576,0,0,0,22,74.543a2.13,2.13,0,0,0,.287,1.845A2.923,2.923,0,0,0,24.755,77.2Zm-3.7,1.023-3.4,9.7h4.827l3.4-9.7Z" transform="translate(-1.888 -48.383)" fill-rule="evenodd"/>
    <path id="Tracé_418" data-name="Tracé 418" d="M82.213,78.212h-5.6l-2.8,3.278,3.06-8.842H71.956L66.613,87.917h4.913L72.9,84.078l.776,3.838h5.128l-.862-4.658Zm22.059-.116a6.406,6.406,0,0,0-4.309,1.6l.56-1.467H95.438l-3.4,9.7h5.085l1.638-4.658a1.381,1.381,0,0,1,1.422-1.079c.733,0,.905.733.689,1.337l-1.551,4.4h4.913l2.2-6.3c.6-1.725,0-3.536-2.155-3.536Zm2.48,7.8a1.016,1.016,0,1,0,1.012,1.012A1.014,1.014,0,0,0,106.752,85.9Zm0,1.908a.891.891,0,1,1,.63-.263A.891.891,0,0,1,106.752,87.805Z" transform="translate(-44.383 -48.383)" fill-rule="evenodd"/>
    <path id="Tracé_419" data-name="Tracé 419" d="M186.659,113.953a.279.279,0,0,0-.128-.244.522.522,0,0,0-.276-.056h-.494v1.135h.138v-.523h.255l.324.523h.164l-.342-.523c.2-.005.358-.088.358-.311Zm-.547.2H185.9v-.4h.324c.14,0,.295.021.295.2C186.519,114.18,186.272,114.154,186.112,114.154Z" transform="translate(-123.77 -75.692)" fill-rule="evenodd"/>
  </g>
</svg>
