<svg id="agc-glass-vector-logo" xmlns="http://www.w3.org/2000/svg" width="92.656" height="31.833" viewBox="0 0 92.656 31.833">
  <path id="Tracé_3231" data-name="Tracé 3231" d="M44.353,253.866H54.377L43.874,223.3H31.626L21,253.866H31.039l1.776-6.348h9.777Zm-9.684-12.958,1.5-5.143L37.6,230.05h.185l1.436,5.715,1.467,5.143Z" transform="translate(-21 -222.404)" fill="#adacac"/>
  <path id="Tracé_3232" data-name="Tracé 3232" d="M471.981,218.906s-2.857-1.406-8.727-1.406S445.4,220.157,445.4,233.223c0,12.619,10.827,16.109,18.735,16.109a21.542,21.542,0,0,0,8.371-1.622l-1.467-6.163a15.347,15.347,0,0,1-6.178,1.081c-3.336,0-9.808-1.066-9.808-9.422s6.6-9.035,8.943-9.035a13.721,13.721,0,0,1,6.3,1.328Z" transform="translate(-379.851 -217.5)" fill="#adacac"/>
  <path id="Tracé_3233" data-name="Tracé 3233" d="M261.946,219.153a25.2,25.2,0,0,0-9.823-1.653c-5.761,0-17.623,2.44-17.623,15.816,0,13,10.935,15.955,17.808,15.955a31.935,31.935,0,0,0,10.75-1.514V229.748l-7.985,6.719v6.163a14.144,14.144,0,0,1-3.213.278c-2.131,0-8.124-1.066-8.124-9.576,0-8.155,5.946-9.1,9.051-9.1a18.174,18.174,0,0,1,7.491,1.529Z" transform="translate(-201.525 -217.5)" fill="#adacac"/>
  <path id="Tracé_3234" data-name="Tracé 3234" d="M328.7,303.6h6.024l7.985-6.7H328.7Z" transform="translate(-281.175 -284.637)" fill="#e3e3e3"/>
</svg>
