<svg xmlns="http://www.w3.org/2000/svg" width="93" height="45" viewBox="0 0 93 45">
  <text id="Wlog" transform="translate(0 36)" fill="#9ba0a5" font-size="36" font-family="SupremeLLTT-Bold, Supreme LL TT" font-weight="700"><tspan x="0" y="0">Wlog</tspan></text>
</svg>
