Suite/Test/Step Name,Browser,Description,Start time,End time,Duration,Status
UserValidation,,,2019-03-25 10:36:17,2019-03-25 10:36:19,"2,458s",PASSED
,,,,,,
Test Cases/User/Validate User Details,,,2019-03-25 10:36:17,2019-03-25 10:36:19,"2,203s",PASSED
"response = sendRequest(findTestObject(""User/GetUserDetails""))",,,2019-03-25 10:36:17,2019-03-25 10:36:19,"1,940s",PASSED
"verifyResponseStatusCode(response, 200)",,,2019-03-25 10:36:19,2019-03-25 10:36:19,"0,007s",PASSED
"verifyElementPropertyValue(response, ""data.first_name"", ""Janet"")",,,2019-03-25 10:36:19,2019-03-25 10:36:19,"0,033s",PASSED
