Suite/Test/Step Name,Browser,Description,Start time,End time,Duration,Status
UserValidation,,,2019-03-29 12:31:02,2019-03-29 12:31:05,"2,738s",PASSED
,,,,,,
Test Cases/User/Validate User Details,,,2019-03-29 12:31:02,2019-03-29 12:31:05,"2,415s",PASSED
"response = sendRequest(findTestObject(""User/GetUserDetails""))",,,2019-03-29 12:31:02,2019-03-29 12:31:05,"2,111s",PASSED
"verifyResponseStatusCode(response, 200)",,,2019-03-29 12:31:05,2019-03-29 12:31:05,"0,004s",PASSED
"verifyElementPropertyValue(response, ""data.first_name"", ""Janet"")",,,2019-03-29 12:31:05,2019-03-29 12:31:05,"0,043s",PASSED
