cod_sociedad;sist_origen;cod_tip_mediador_or;tr_tip_mediador_or;desde;hasta
SSL1;SIIS;A;RES;09/01/2021;12/31/9999
SSL1;SIIS;C;CORR;09/01/2021;12/31/9999
SSL1;SIIS;E;ENTCOL;09/01/2021;12/31/9999
SSL1;SIIS;L;RES;09/01/2021;12/31/9999
SSL1;SIIS;S;RES;09/01/2021;12/31/9999
SSL1;SIIS;U;RES;09/01/2021;12/31/9999
SSL1;SIIS;X;AGEXC;09/01/2021;12/31/9999
