nombre_campo;nullabilidad_campo;desde;hasta
IMP_TOTAL_LIQ;t;15/07/2022;31/12/9999
IMP_RETEN_INTER;t;15/07/2022;31/12/9999
IMP_TIPO_IVA;t;15/07/2022;31/12/9999
TAS_TIPO_IVA;t;15/07/2022;31/12/9999
COD_SOCIEDAD;t;15/07/2022;31/12/9999
SIST_ORIGEN;t;15/07/2022;31/12/9999
COD_RAMO;t;15/07/2022;31/12/9999
COD_MODALIDAD;t;15/07/2022;31/12/9999
COD_GARANTIA;t;15/07/2022;31/12/9999
COD_RAMO_CONT;t;15/07/2022;31/12/9999
COD_MODALIDAD_CONT;t;15/07/2022;31/12/9999
COD_CERTIFICADO;t;15/07/2022;31/12/9999
NUM_SINIESTRO;t;15/07/2022;31/12/9999
TIP_FACTURA;t;15/07/2022;31/12/9999
NUM_FACT_SECUNDARIA;t;15/07/2022;31/12/9999
NUM_GASTOS;t;15/07/2022;31/12/9999
COD_V_PAGO;t;15/07/2022;31/12/9999
NUM_REM_PAGO;t;15/07/2022;31/12/9999
SIG;t;15/07/2022;31/12/9999
COD_DIVISA;t;15/07/2022;31/12/9999
TAS_RETEN;t;15/07/2022;31/12/9999
COD_POLIZA;t;15/07/2022;31/12/9999
COD_TIPO_IVA;t;15/07/2022;31/12/9999
IMP_HONORARIOS;t;15/07/2022;31/12/9999
COD_TIPO_REGE;t;15/07/2022;31/12/9999
COD_EST_REC;t;15/07/2022;31/12/9999
COD_EST_REC;t;15/07/2022;31/12/9999
COD_EST_MOVIMIENTO;t;15/07/2022;31/12/9999
COD_TIP_SINIESTRO;t;15/07/2022;31/12/9999
IMP_GTO_NO_SUJ;t;15/07/2022;31/12/9999
IMP_GTO_SUJ;t;15/07/2022;31/12/9999
IMP_GTO_SUJ_IVA;t;15/07/2022;31/12/9999
IMP_DEDUCCION;t;15/07/2022;31/12/9999
COD_TIP_COASEG;t;15/07/2022;31/12/9999
NOM_BENEFICIARIO_PAGO;t;15/07/2022;31/12/9999
NIF;t;15/07/2022;31/12/9999
DOMICILIO;t;15/07/2022;31/12/9999
NOM_POBL;t;15/07/2022;31/12/9999
COD_POSTAL;t;15/07/2022;31/12/9999
NUM_EXPEDIENTE;t;15/07/2022;31/12/9999
FEC_DOC;t;15/07/2022;31/12/9999
FEC_LIQ;t;15/07/2022;31/12/9999
COD_CAUSA_SINIESTRO;t;15/07/2022;31/12/9999
MAR_GRAN_SINIENTRO;t;15/07/2022;31/12/9999
COD_R_ACREEDOR;t;15/07/2022;31/12/9999
COD_TIP_MOVIMIENTO;t;15/07/2022;31/12/9999
COD_AGENCIA_OR;t;15/07/2022;31/12/9999
COD_TIP_MEDIADOR_OR;t;15/07/2022;31/12/9999
COD_MEDIADOR_OR;t;15/07/2022;31/12/9999
COD_COLABORADOR_OR;t;15/07/2022;31/12/9999
COD_AGENCIA_TR;t;15/07/2022;31/12/9999
COD_TIP_MEDIADOR_TR;t;15/07/2022;31/12/9999
COD_MEDIADOR_TR;t;15/07/2022;31/12/9999
COD_COLABORADOR_TR;t;15/07/2022;31/12/9999
COD_TIP_GESTION;t;15/07/2022;31/12/9999
CIF_FACT_PRINCIPAL;t;15/07/2022;31/12/9999
NUM_FACT_PRINCIPAL;t;15/07/2022;31/12/9999
COD_RECIBO_ODL;t;15/07/2022;31/12/9999
IMP_PRIM_TARIFA;t;15/07/2022;31/12/9999
COD_POLIZA;t;15/07/2022;31/12/9999
COD_RECIBO_ODL;t;15/07/2022;31/12/9999
PAIS;t;15/07/2022;31/12/9999
REGION;t;15/07/2022;31/12/9999
CTA_BANC_IBAN;t;15/07/2022;31/12/9999
CTA_BANC_BIC;t;15/07/2022;31/12/9999
COD_MODALIDAD;t;15/07/2022;31/12/9999
COD_SOCIEDAD;t;15/07/2022;31/12/9999
COD_RAMO_CONT;t;15/07/2022;31/12/9999
FEC_TRAMITACION;t;15/07/2022;31/12/9999
MAR_CUADERNO_234;t;15/07/2022;31/12/9999
IMP_FACTURA;t;15/07/2022;31/12/9999
IMP_FACTURA_SUPLIDO;t;15/07/2022;31/12/9999
IMP_HONORARIOS_SUPL;t;15/07/2022;31/12/9999
IMP_PROVISION;t;15/07/2022;31/12/9999
TAS_TIPO_REGE;t;15/07/2022;31/12/9999
IMP_TIPO_REGE;t;15/07/2022;31/12/9999
IMP_COA;t;15/07/2022;31/12/9999
FEC_OCURRENCIA;t;15/07/2022;31/12/9999
FEC_DECLARACION;t;15/07/2022;31/12/9999
FEC_MOVIMIENTO;t;15/07/2022;31/12/9999
IMP_SINIESTRO;t;15/07/2022;31/12/9999
SIST_ORIGEN;t;15/07/2022;31/12/9999
COD_RAMO;t;15/07/2022;31/12/9999
COD_GARANTIA;t;15/07/2022;31/12/9999
COD_MODALIDAD_CONT;t;15/07/2022;31/12/9999
COD_CERTIFICADO;t;15/07/2022;31/12/9999
COD_RECIBO;t;15/07/2022;31/12/9999
COD_PROCEDENCIA;t;15/07/2022;31/12/9999
MAR_NUEV_RECIBO;t;15/07/2022;31/12/9999
COD_RECIBO_PR;t;15/07/2022;31/12/9999
COD_DIVISA;t;15/07/2022;31/12/9999
IMP_PRIM_UNIC;t;15/07/2022;31/12/9999
IMP_PRIM_PERIOD;t;15/07/2022;31/12/9999
IMP_PRIM_EXTOR_EJER;t;15/07/2022;31/12/9999
IMP_PRIM_EXTOR_EJER_ANT;t;15/07/2022;31/12/9999
COD_PROCEDENCIA;t;15/07/2022;31/12/9999
MAR_NUEV_RECIBO;t;15/07/2022;31/12/9999
COD_RECIBO_PR;t;15/07/2022;31/12/9999
COD_DIVISA;t;15/07/2022;31/12/9999
IMP_PRIM_TARIFA;t;15/07/2022;31/12/9999
IMP_PRIM_UNIC;t;15/07/2022;31/12/9999
IMP_PRIM_PERIOD;t;15/07/2022;31/12/9999
IMP_PRIM_EXTOR_EJER;t;15/07/2022;31/12/9999
IMP_PRIM_EXTOR_EJER_ANT;t;15/07/2022;31/12/9999
IMP_PRIM_ANUL_EJER_ANT;t;15/07/2022;31/12/9999
IMP_IPS;t;15/07/2022;31/12/9999
IMP_TAS_CCS_REC_RIES_EXTR;t;15/07/2022;31/12/9999
IMP_TAS_CCS_REC_FUN_LIQ;t;15/07/2022;31/12/9999
IMP_TAS_CCS_PRIM_PEND_COBR;t;15/07/2022;31/12/9999
IMP_ARB_BOMBEROS;t;15/07/2022;31/12/9999
IMP_COMISIONES;t;15/07/2022;31/12/9999
IMP_TOT_RECIB;t;15/07/2022;31/12/9999
ID_MOV_ECON;t;15/07/2022;31/12/9999
FEC_MOV_ECON;t;15/07/2022;31/12/9999
FEC_EMI;t;15/07/2022;31/12/9999
FEC_LIQ;t;15/07/2022;31/12/9999
COD_PER_PAGO;t;15/07/2022;31/12/9999
COMP;t;15/07/2022;31/12/9999
COD_COB_INT;f;15/07/2022;31/12/9999
COD_TIP_SIN;t;15/07/2022;31/12/9999
COD_ANTICIPO;f;15/07/2022;31/12/9999
COD_AGENCIA;f;15/07/2022;31/12/9999
COD_TIP_MEDIADOR;f;15/07/2022;31/12/9999
COD_MEDIADOR;f;15/07/2022;31/12/9999
COD_COLABORADOR;t;15/07/2022;31/12/9999
COD_TIP_GESTION;t;15/07/2022;31/12/9999
COD_MED_CP;t;15/07/2022;31/12/9999
COD_TIP_COASEG;f;15/07/2022;31/12/9999
IMP_DESCUENTO;t;15/07/2022;31/12/9999
IMP_DESCUENTO;t;15/07/2022;31/12/9999
IMP_PRIM_REAL;t;15/07/2022;31/12/9999
IMP_PRIM_TARIFA_COA;t;15/07/2022;31/12/9999
IMP_PRIM_UNIC_COA;t;15/07/2022;31/12/9999
IMP_PRIM_PERIOD_COA;t;15/07/2022;31/12/9999
IMP_PRIM_EXTOR_EJER_COA;t;15/07/2022;31/12/9999
IMP_PRIM_EXTOR_EJER_ANT_COA;t;15/07/2022;31/12/9999
IMP_PRIM_ANUL_EJER_ANT_COA;t;15/07/2022;31/12/9999
IMP_IPS_COA;t;15/07/2022;31/12/9999
IMP_TAS_CCS_REC_RIES_EXTR_COA;t;15/07/2022;31/12/9999
IMP_TAS_CCS_REC_FUN_LIQ_COA;t;15/07/2022;31/12/9999
IMP_TAS_CCS_PRIM_PEND_COBR_COA;t;15/07/2022;31/12/9999
IMP_ARB_BOMBEROS_COA;t;15/07/2022;31/12/9999
IMP_COM_COA;t;15/07/2022;31/12/9999
IMP_TOT_RECIB_COA;t;15/07/2022;31/12/9999
IMP_DESCUENTO_COA;t;15/07/2022;31/12/9999
IMP_PRIM_REAL_COA;t;15/07/2022;31/12/9999
NOM_DESTINATARIO;t;15/07/2022;31/12/9999
NOM_POBL;t;15/07/2022;31/12/9999
NIF;t;15/07/2022;31/12/9999
CTA_BANC_IBAN;t;15/07/2022;31/12/9999
COD_SOCIEDAD;t;15/07/2022;31/12/9999
SIST_ORIGEN;t;15/07/2022;31/12/9999
COD_POLIZA;t;15/07/2022;31/12/9999
COD_RAMO;t;15/07/2022;31/12/9999
COD_MODALIDAD;t;15/07/2022;31/12/9999
COD_GARANTIA;t;15/07/2022;31/12/9999
COD_RAMO_CONT;t;15/07/2022;31/12/9999
COD_MODALIDAD_CONT;t;15/07/2022;31/12/9999
COD_CERTIFICADO;t;15/07/2022;31/12/9999
COD_RECIBO;t;15/07/2022;31/12/9999
COD_TIP_RECIB;t;15/07/2022;31/12/9999
IMP_PRIM_ANUL_EJER_ANT;t;15/07/2022;31/12/9999
IMP_IPS;t;15/07/2022;31/12/9999
IMP_TAS_CCS_REC_RIES_EXTR;t;15/07/2022;31/12/9999
IMP_TAS_CCS_REC_FUN_LIQ;t;15/07/2022;31/12/9999
IMP_TAS_CCS_PRIM_PEND_COBR;t;15/07/2022;31/12/9999
IMP_ARB_BOMBEROS;t;15/07/2022;31/12/9999
IMP_COMISIONES;t;15/07/2022;31/12/9999
IMP_TOT_RECIB;t;15/07/2022;31/12/9999
ID_MOV_ECON;t;15/07/2022;31/12/9999
FEC_MOV_ECON;t;15/07/2022;31/12/9999
FEC_EMI;t;15/07/2022;31/12/9999
COD_TIP_RECIB;t;15/07/2022;31/12/9999
COD_PER_PAGO;t;15/07/2022;31/12/9999
COMP;t;15/07/2022;31/12/9999
COD_COB_INT;t;15/07/2022;31/12/9999
COD_TIP_SIN;t;15/07/2022;31/12/9999
COD_ANTICIPO;t;15/07/2022;31/12/9999
COD_AGENCIA;t;15/07/2022;31/12/9999
COD_TIP_MEDIADOR;t;15/07/2022;31/12/9999
COD_MEDIADOR;t;15/07/2022;31/12/9999
COD_COLABORADOR;t;15/07/2022;31/12/9999
COD_MED_CP;t;15/07/2022;31/12/9999
COD_TIP_COASEG;t;15/07/2022;31/12/9999
IMP_DESCUENTO;t;15/07/2022;31/12/9999
IMP_PRIM_REAL;t;15/07/2022;31/12/9999
IMP_PRIM_TARIFA_COA;t;15/07/2022;31/12/9999
IMP_PRIM_UNIC_COA;t;15/07/2022;31/12/9999
IMP_PRIM_PERIOD_COA;t;15/07/2022;31/12/9999
IMP_PRIM_EXTOR_EJER_COA;t;15/07/2022;31/12/9999
IMP_PRIM_EXTOR_EJER_ANT_COA;t;15/07/2022;31/12/9999
IMP_PRIM_ANUL_EJER_ANT_COA;t;15/07/2022;31/12/9999
IMP_IPS_COA;t;15/07/2022;31/12/9999
IMP_TAS_CCS_REC_RIES_EXTR_COA;t;15/07/2022;31/12/9999
IMP_TAS_CCS_REC_FUN_LIQ_COA;t;15/07/2022;31/12/9999
IMP_TAS_CCS_PRIM_PEND_COBR_COA;t;15/07/2022;31/12/9999
IMP_ARB_BOMBEROS_COA;t;15/07/2022;31/12/9999
IMP_COM_COA;t;15/07/2022;31/12/9999
IMP_TOT_RECIB_COA;t;15/07/2022;31/12/9999
IMP_DESCUENTO_COA;t;15/07/2022;31/12/9999
IMP_PRIM_REAL_COA;t;15/07/2022;31/12/9999
NOM_DESTINATARIO;t;15/07/2022;31/12/9999
NOM_POBL;t;15/07/2022;31/12/9999
NIF;t;15/07/2022;31/12/9999
CTA_BANC_IBAN;t;15/07/2022;31/12/9999
CTA_BANC_BIC;t;15/07/2022;31/12/9999
ENT_BANCARIA;t;15/07/2022;31/12/9999
ENT_BANCARIA;t;15/07/2022;31/12/9999
CTA_BANC_BIC;t;15/07/2022;31/12/9999
MAR_CUADERNO_234;t;15/07/2022;31/12/9999
FEC_LIQ;t;15/07/2022;31/12/9999
COD_TIP_GESTION;t;15/07/2022;31/12/9999
