{
    "CD-CONTRATTO": "706735",
    "CD-CLIENTE": "161569",
    "NM-TEL": "11-1111111",
    "IND-EMAIL": "",

    "RATA": [
        {
            "CHECKED": true, "IMP-RATA": 84.00,"DT-RATA": "15/05/1992",
            "NR-RATA": 36, "FORMAT": "€84,00"
        },
        {
            "CHECKED": true, "IMP-RATA": 30.00,"DT-RATA": "15/04/1992",
            "NR-RATA": 35, "FORMAT": "€30,00"
        },
        {
            "CHECKED": true, "IMP-RATA": 10.00,"DT-RATA": "15/03/1992",
            "NR-RATA": 34, "FORMAT": "€10,00"
        },
        {
            "CHECKED": true, "IMP-RATA": 100.00,"DT-RATA": "15/02/1992",
            "NR-RATA": 33, "FORMAT": "€100,00"
         }
    ],

    "SPESE-AFFIDO": "0 ",
    "CD-PRATICA": "66632234 ",
    "IMPOSTA-SOSTITUTIVA": "1 "
}
