2.627321191024780092e+02
2.995651512145996165e+01
1.905125930786132926e+01
1.761909732818603658e+01
1.643165622711181584e+01
1.583046730995178208e+01
1.523777432441711355e+01
1.456874767303466811e+01
1.402926655769348230e+01
1.347243266105651927e+01
1.302502055168151784e+01
1.259552042007446282e+01
1.220486760139465332e+01
1.182256378173828182e+01
1.141947636604309047e+01
1.122446015357971127e+01
1.095376033782958913e+01
1.062012186050415075e+01
1.040701133728027372e+01
1.024461338996887250e+01
9.957157583236694975e+00
9.765307359695434286e+00
9.616646013259888548e+00
9.446371049880982085e+00
9.263339958190918821e+00
9.181514978408813477e+00
8.936533598899840669e+00
8.824798550605773784e+00
8.758009381294250772e+00
8.719836044311524148e+00
8.601517663002013592e+00
8.493830718994139772e+00
8.383744516372679811e+00
8.364351320266724343e+00
8.289124822616576793e+00
8.269573340415954377e+00
8.191226310729980753e+00
8.045702624320984597e+00
7.860761213302612127e+00
7.759940319061279013e+00
7.713706727027893173e+00
7.675419631004333887e+00
7.644974741935730123e+00
7.702705430984496893e+00
7.596453046798705699e+00
7.519415774345397985e+00
7.501856069564819762e+00
7.483432531356811523e+00
7.445282297134399485e+00
7.406052851676941273e+00
