2.560740779113769463e+02
2.777786706924438320e+01
1.816607467651367358e+01
1.624587894439697422e+01
1.505445181846618574e+01
1.392258421897888176e+01
1.340360534667968828e+01
1.292847372055053690e+01
1.248165550231933629e+01
1.207716228485107379e+01
1.172435224533081133e+01
1.148931203842163029e+01
1.127216864585876444e+01
1.095836178779602044e+01
1.066333707809448228e+01
1.048775051116943402e+01
1.026792891502380378e+01
1.010094063758850069e+01
9.891869525909424254e+00
9.767669210433959748e+00
9.513951721191405753e+00
9.379967975616455789e+00
9.312215409278870482e+00
9.164102764129639311e+00
9.143008756637573953e+00
8.964059967994689515e+00
8.865089740753173686e+00
8.770319175720214133e+00
8.539780411720276021e+00
8.366663284301758097e+00
8.329999527931214232e+00
8.312686433792114471e+00
8.205293846130370383e+00
8.091057233810424520e+00
8.076503200531005788e+00
7.975864496231078959e+00
7.986762161254882919e+00
7.934011030197143377e+00
7.884130458831787536e+00
7.890550060272216726e+00
7.859539895057678471e+00
7.848460836410522390e+00
7.817056021690368617e+00
7.739099721908569762e+00
7.759978995323181472e+00
7.736467375755309739e+00
7.749316644668579279e+00
7.675654163360595916e+00
7.718121948242187891e+00
7.670834841728210840e+00
