{
	"folders": {},
	"connections": {
		"mysql8-17d4c19a03e-290fb89f8d29d975": {
			"provider": "mysql",
			"driver": "mysql8",
			"name": "alten",
			"save-password": true,
			"read-only": false,
			"configuration": {
				"host": "localhost",
				"port": "3306",
				"database": "alten",
				"url": "jdbc:mysql://localhost:3306/alten",
				"home": "C:\\Program Files\\MySQL\\MySQL Server 5.7",
				"type": "dev",
				"properties": {
					"connectTimeout": "20000",
					"rewriteBatchedStatements": "true",
					"enabledTLSProtocols": "TLSv1,TLSv1.1,TLSv1.2"
				},
				"auth-model": "native",
				"handlers": {}
			}
		}
	},
	"connection-types": {
		"dev": {
			"name": "Development",
			"color": "255,255,255",
			"description": "Regular development database",
			"auto-commit": true,
			"confirm-execute": false,
			"confirm-data-change": false,
			"auto-close-transactions": false
		}
	}
}