{
    "symbol": "Test-sybol2",
    "bids":[
        {
            "px": 5.5,
            "qty": 3.3,
            "num": 321
        },
        {
            "px": 6.5,
            "qty": 7.21,
            "num": 512
        }
    ],
    "sellorders":[
        {
            "px": 1043,
            "qty": 120,
            "num": 1343
        },
        {
            "px": 2.25,
            "qty": 221.432,
            "num": 2432
        },
        {
            "px": 23.25,
            "qty": 2221.432,
            "num": 7162
        }
    ]
}