{
  "project_info": {
    "project_number": "726389633186",
    "project_id": "handball-stats-169fa",
    "storage_bucket": "handball-stats-169fa.appspot.com"
  },
  "client": [
    {
      "client_info": {
        "mobilesdk_app_id": "1:726389633186:android:dd7d45e747ed3951e027fb",
        "android_client_info": {
          "package_name": "hr.ferit.antoniocarevic.handballstats"
        }
      },
      "oauth_client": [],
      "api_key": [
        {
          "current_key": "AIzaSyAKkmDw216Onkenehmo3dZ-j_RqygtWy3s"
        }
      ],
      "services": {
        "appinvite_service": {
          "other_platform_oauth_client": []
        }
      }
    }
  ],
  "configuration_version": "1"
}