@startuml
!pragma useIntermediatePackages false

class "VehicleController" as io.gitlab.plunts.gradle.plantuml.examples.app.controller.VehicleController {
  +List<VehicleDto> listVehicles(int, int)
}
class "VehicleService" as io.gitlab.plunts.gradle.plantuml.examples.app.service.VehicleService {
  +List<Vehicle> getVehicles(int, int)
}
io.gitlab.plunts.gradle.plantuml.examples.app.controller.VehicleController --> io.gitlab.plunts.gradle.plantuml.examples.app.service.VehicleService
@enduml
