{
  "iisSettings": {
    "windowsAuthentication": false,
    "anonymousAuthentication": true,
    "iisExpress": {
      "applicationUrl": "http://localhost:50163/",
      "sslPort": 0
    }
  },
  "profiles": {
    "IIS Express": {
      "commandName": "IISExpress",
      "launchBrowser": true,
      "launchUrl": "api/",
      "environmentVariables": {
        "ASPNETCORE_ENVIRONMENT": "Development"
      }
    },
    "Zhant.Wrike.Integration.GitLab": {
      "commandName": "Project",
      "launchBrowser": true,
      "launchUrl": "api/",
      "environmentVariables": {
        "ASPNETCORE_ENVIRONMENT": "Development"
      },
      "applicationUrl": "http://localhost:42839/"
    },
    "IIS": {
      "commandName": "IIS",
      "workingDirectory": "http://localhost/Zhant.Wrike.Integration.GitLab.Web",
      "launchBrowser": true,
      "launchUrl": "http://localhost/Zhant.Wrike.Integration.GitLab.Web"
    }
  }
}