info face=souses size=72 bold=0 italic=0 charset= unicode= stretchH=100 smooth=1 aa=1 padding=2,2,2,2 spacing=0,0 outline=0
common lineHeight=85 base=54 scaleW=466 scaleH=511 pages=1 packed=0
page id=0 file="souses.png"
chars count=56
char id=97 x=2 y=2 width=52 height=47 xoffset=0 yoffset=16 xadvance=44 page=0 chnl=15
char id=98 x=2 y=51 width=52 height=63 xoffset=1 yoffset=1 xadvance=45 page=0 chnl=15
char id=99 x=2 y=116 width=47 height=47 xoffset=-2 yoffset=16 xadvance=36 page=0 chnl=15
char id=100 x=2 y=165 width=54 height=62 xoffset=0 yoffset=1 xadvance=45 page=0 chnl=15
char id=101 x=51 y=116 width=49 height=47 xoffset=-2 yoffset=16 xadvance=40 page=0 chnl=15
char id=102 x=56 y=2 width=43 height=62 xoffset=2 yoffset=0 xadvance=31 page=0 chnl=15
char id=103 x=101 y=2 width=52 height=61 xoffset=-1 yoffset=16 xadvance=44 page=0 chnl=15
char id=104 x=2 y=229 width=51 height=60 xoffset=1 yoffset=1 xadvance=45 page=0 chnl=15
char id=105 x=2 y=291 width=32 height=62 xoffset=0 yoffset=0 xadvance=22 page=0 chnl=15
char id=106 x=2 y=355 width=41 height=80 xoffset=-8 yoffset=0 xadvance=22 page=0 chnl=15
char id=107 x=36 y=291 width=50 height=62 xoffset=1 yoffset=1 xadvance=42 page=0 chnl=15
char id=108 x=55 y=229 width=32 height=60 xoffset=1 yoffset=1 xadvance=24 page=0 chnl=15
char id=109 x=56 y=66 width=73 height=46 xoffset=1 yoffset=17 xadvance=68 page=0 chnl=15
char id=110 x=58 y=165 width=50 height=46 xoffset=1 yoffset=17 xadvance=45 page=0 chnl=15
char id=111 x=102 y=114 width=50 height=47 xoffset=-2 yoffset=16 xadvance=42 page=0 chnl=15
char id=112 x=2 y=437 width=54 height=61 xoffset=-2 yoffset=17 xadvance=45 page=0 chnl=15
char id=113 x=45 y=355 width=52 height=63 xoffset=-2 yoffset=16 xadvance=45 page=0 chnl=15
char id=114 x=131 y=65 width=45 height=46 xoffset=1 yoffset=17 xadvance=33 page=0 chnl=15
char id=115 x=155 y=2 width=48 height=47 xoffset=-3 yoffset=16 xadvance=36 page=0 chnl=15
char id=116 x=88 y=291 width=39 height=56 xoffset=1 yoffset=7 xadvance=30 page=0 chnl=15
char id=117 x=89 y=213 width=51 height=46 xoffset=0 yoffset=17 xadvance=46 page=0 chnl=15
char id=118 x=110 y=163 width=52 height=47 xoffset=3 yoffset=15 xadvance=43 page=0 chnl=15
char id=119 x=154 y=113 width=69 height=46 xoffset=3 yoffset=17 xadvance=60 page=0 chnl=15
char id=120 x=178 y=51 width=54 height=49 xoffset=-3 yoffset=15 xadvance=41 page=0 chnl=15
char id=121 x=58 y=420 width=53 height=61 xoffset=0 yoffset=17 xadvance=45 page=0 chnl=15
char id=122 x=205 y=2 width=49 height=46 xoffset=-3 yoffset=17 xadvance=37 page=0 chnl=15
char id=65 x=99 y=349 width=66 height=62 xoffset=-5 yoffset=1 xadvance=54 page=0 chnl=15
char id=66 x=129 y=261 width=56 height=60 xoffset=1 yoffset=2 xadvance=49 page=0 chnl=15
char id=67 x=113 y=413 width=56 height=62 xoffset=-2 yoffset=1 xadvance=46 page=0 chnl=15
char id=68 x=167 y=323 width=59 height=60 xoffset=1 yoffset=3 xadvance=51 page=0 chnl=15
char id=69 x=164 y=161 width=54 height=59 xoffset=1 yoffset=3 xadvance=44 page=0 chnl=15
char id=70 x=187 y=222 width=56 height=59 xoffset=1 yoffset=3 xadvance=44 page=0 chnl=15
char id=71 x=225 y=102 width=57 height=62 xoffset=0 yoffset=1 xadvance=50 page=0 chnl=15
char id=72 x=256 y=2 width=65 height=59 xoffset=2 yoffset=3 xadvance=57 page=0 chnl=15
char id=73 x=171 y=385 width=48 height=59 xoffset=-1 yoffset=2 xadvance=35 page=0 chnl=15
char id=74 x=171 y=446 width=51 height=61 xoffset=-4 yoffset=2 xadvance=37 page=0 chnl=15
char id=75 x=224 y=385 width=59 height=61 xoffset=1 yoffset=1 xadvance=50 page=0 chnl=15
char id=76 x=224 y=448 width=46 height=60 xoffset=1 yoffset=3 xadvance=42 page=0 chnl=15
char id=77 x=272 y=448 width=80 height=61 xoffset=-4 yoffset=2 xadvance=71 page=0 chnl=15
char id=78 x=228 y=283 width=63 height=60 xoffset=2 yoffset=1 xadvance=55 page=0 chnl=15
char id=79 x=285 y=345 width=59 height=62 xoffset=0 yoffset=1 xadvance=53 page=0 chnl=15
char id=80 x=245 y=166 width=59 height=61 xoffset=1 yoffset=2 xadvance=50 page=0 chnl=15
char id=81 x=284 y=63 width=59 height=70 xoffset=2 yoffset=1 xadvance=52 page=0 chnl=15
char id=82 x=293 y=229 width=58 height=61 xoffset=1 yoffset=2 xadvance=50 page=0 chnl=15
char id=83 x=306 y=135 width=58 height=62 xoffset=-3 yoffset=1 xadvance=44 page=0 chnl=15
char id=84 x=345 y=2 width=55 height=60 xoffset=3 yoffset=2 xadvance=46 page=0 chnl=15
char id=85 x=345 y=64 width=58 height=60 xoffset=2 yoffset=3 xadvance=53 page=0 chnl=15
char id=86 x=402 y=2 width=62 height=60 xoffset=5 yoffset=1 xadvance=51 page=0 chnl=15
char id=87 x=346 y=292 width=83 height=62 xoffset=5 yoffset=1 xadvance=73 page=0 chnl=15
char id=88 x=346 y=356 width=65 height=64 xoffset=-4 yoffset=0 xadvance=48 page=0 chnl=15
char id=89 x=354 y=422 width=57 height=62 xoffset=5 yoffset=0 xadvance=47 page=0 chnl=15
char id=90 x=353 y=199 width=58 height=59 xoffset=-1 yoffset=3 xadvance=45 page=0 chnl=15
char id=46 x=129 y=323 width=26 height=23 xoffset=-2 yoffset=40 xadvance=21 page=0 chnl=15
char id=33 x=366 y=126 width=37 height=62 xoffset=-1 yoffset=1 xadvance=26 page=0 chnl=15
char id=63 x=405 y=64 width=46 height=61 xoffset=4 yoffset=1 xadvance=40 page=0 chnl=15
char id=44 x=113 y=477 width=26 height=32 xoffset=-2 yoffset=40 xadvance=21 page=0 chnl=15
char id=32 x=0 y=0 width=0 height=0 xoffset=-2 yoffset=40 xadvance=19 page=0 chnl=15