%YAML 1.1
%TAG !u! tag:unity3d.com,2011:
--- !u!1001 &100100000
Prefab:
  m_ObjectHideFlags: 1
  serializedVersion: 2
  m_Modification:
    m_TransformParent: {fileID: 0}
    m_Modifications: []
    m_RemovedComponents: []
  m_ParentPrefab: {fileID: 0}
  m_RootGameObject: {fileID: 1622564413472632}
  m_IsPrefabParent: 1
--- !u!1 &1622564413472632
GameObject:
  m_ObjectHideFlags: 0
  m_PrefabParentObject: {fileID: 0}
  m_PrefabInternal: {fileID: 100100000}
  serializedVersion: 5
  m_Component:
  - component: {fileID: 4939158529728938}
  - component: {fileID: 114491915703275396}
  m_Layer: 0
  m_Name: GAv4
  m_TagString: Untagged
  m_Icon: {fileID: 0}
  m_NavMeshLayer: 0
  m_StaticEditorFlags: 0
  m_IsActive: 1
--- !u!4 &4939158529728938
Transform:
  m_ObjectHideFlags: 1
  m_PrefabParentObject: {fileID: 0}
  m_PrefabInternal: {fileID: 100100000}
  m_GameObject: {fileID: 1622564413472632}
  m_LocalRotation: {x: 0, y: 0, z: 0, w: 1}
  m_LocalPosition: {x: 0, y: 0, z: 0}
  m_LocalScale: {x: 1, y: 1, z: 1}
  m_Children: []
  m_Father: {fileID: 0}
  m_RootOrder: 0
  m_LocalEulerAnglesHint: {x: 0, y: 0, z: 0}
--- !u!114 &114491915703275396
MonoBehaviour:
  m_ObjectHideFlags: 1
  m_PrefabParentObject: {fileID: 0}
  m_PrefabInternal: {fileID: 100100000}
  m_GameObject: {fileID: 1622564413472632}
  m_Enabled: 1
  m_EditorHideFlags: 0
  m_Script: {fileID: 11500000, guid: 699b5a441535a4c0bbf3f39cba866bc5, type: 3}
  m_Name: 
  m_EditorClassIdentifier: 
  androidTrackingCode: UA-71733922-3
  IOSTrackingCode: UA-71733922-3
  otherTrackingCode: UA-71733922-3
  productName: Wheels on Wheel
  bundleIdentifier: com.cheese.life.driver
  bundleVersion: 1.53
  dispatchPeriod: 5
  sampleFrequency: 100
  logLevel: 3
  anonymizeIP: 0
  UncaughtExceptionReporting: 1
  sendLaunchEvent: 0
  dryRun: 0
  sessionTimeout: 1800
  enableAdId: 1
