%YAML 1.1
%TAG !u! tag:unity3d.com,2011:
--- !u!114 &11400000
MonoBehaviour:
  m_ObjectHideFlags: 0
  m_PrefabParentObject: {fileID: 0}
  m_PrefabInternal: {fileID: 0}
  m_GameObject: {fileID: 0}
  m_Enabled: 1
  m_EditorHideFlags: 0
  m_Script: {fileID: 11500000, guid: 68a95d87221e6f8448109faa6298b517, type: 3}
  m_Name: CitySmallObstacles
  m_EditorClassIdentifier: 
  m_Items:
  - m_Prefab: {fileID: 1049595787709590, guid: 328069797e22162458c6152d2fe8aa02, type: 2}
    m_Width: 3
    m_StringCode: 111
  - m_Prefab: {fileID: 1722391239484570, guid: a99ad2e797b6e684a9e1b4ba34d5b0ec, type: 2}
    m_Width: 2
    m_StringCode: 11
  - m_Prefab: {fileID: 1647953771531158, guid: cf5232bec4cf62a429834ead6d18c3c5, type: 2}
    m_Width: 2
    m_StringCode: 11
  - m_Prefab: {fileID: 1741445946214454, guid: 7361b4df8930b0d4e9d3d6946cb5e14a, type: 2}
    m_Width: 2
    m_StringCode: 11
  - m_Prefab: {fileID: 1283504562524698, guid: ae9796805fc507a49a4a9f3e28b294b5, type: 2}
    m_Width: 2
    m_StringCode: 11
  - m_Prefab: {fileID: 1377342022852466, guid: cc17eb331596fd34a81383d88627ea4c, type: 2}
    m_Width: 2
    m_StringCode: 11
  - m_Prefab: {fileID: 1861335813626746, guid: aba26145ce28137489b8c7e60a34c01e, type: 2}
    m_Width: 2
    m_StringCode: 11
  - m_Prefab: {fileID: 1555421412166070, guid: 2510afeb7fc18504bafcba84d29a6c87, type: 2}
    m_Width: 2
    m_StringCode: 11
