%YAML 1.1
%TAG !u! tag:unity3d.com,2011:
--- !u!114 &11400000
MonoBehaviour:
  m_ObjectHideFlags: 0
  m_PrefabParentObject: {fileID: 0}
  m_PrefabInternal: {fileID: 0}
  m_GameObject: {fileID: 0}
  m_Enabled: 1
  m_EditorHideFlags: 0
  m_Script: {fileID: 11500000, guid: 68a95d87221e6f8448109faa6298b517, type: 3}
  m_Name: ForestMediumObstacles
  m_EditorClassIdentifier: 
  m_Items:
  - m_Prefab: {fileID: 1158304094702240, guid: bbc99e3c82472634aa7ce8a293982c2e, type: 2}
    m_Width: 3
    m_StringCode: 111
