%YAML 1.1
%TAG !u! tag:unity3d.com,2011:
--- !u!114 &11400000
MonoBehaviour:
  m_ObjectHideFlags: 0
  m_PrefabParentObject: {fileID: 0}
  m_PrefabInternal: {fileID: 0}
  m_GameObject: {fileID: 0}
  m_Enabled: 1
  m_EditorHideFlags: 0
  m_Script: {fileID: 11500000, guid: 8085da239bf7e4632b118f842e694451, type: 3}
  m_Name: ShareSettings
  m_EditorClassIdentifier: 
  androidForceSDCardPermission: 0
  showButtonShareWhenSceneRestartIfScreenshotAvailable: 0
  state: 0
  isShareFoldoutOpened: 1
