%YAML 1.1
%TAG !u! tag:unity3d.com,2011:
--- !u!114 &11400000
MonoBehaviour:
  m_ObjectHideFlags: 0
  m_PrefabParentObject: {fileID: 0}
  m_PrefabInternal: {fileID: 0}
  m_GameObject: {fileID: 0}
  m_Enabled: 1
  m_EditorHideFlags: 0
  m_Script: {fileID: 11500000, guid: f393b78a70c8a044587740267f044609, type: 3}
  m_Name: 6RaceCarA
  m_EditorClassIdentifier: 
  m_Renderer: {fileID: 1383879767226886, guid: 4c969bf9a13b13b48a50eb698aaf2e5f, type: 2}
  m_Preview: {fileID: 1807570755389532, guid: a3d603048a5b92f42aa668d0f7a329a0, type: 2}
  m_PreviewSprite: {fileID: 21300000, guid: 9b57762e6ef7b8a48b9408a6558826d1, type: 3}
  m_PreviewSpriteShop: {fileID: 21300000, guid: 359b61e73c4517e40971b55f0b97468f,
    type: 3}
  m_Label: Speedy
  m_MovingSpeed: 100
  m_AdditionalScore: 15
  m_AdditionalCoins: 15
  m_AdditionalLandSpeed: 10
  m_SpecialAbilityName: 
  m_Price: 3000
  m_Health: 1
  m_PossibleLevelThemes:
  - {fileID: 11400000, guid: b59cf85ec0cb9bb46a2dbed11918e095, type: 2}
  m_Animals:
  - {fileID: 1604044716703520, guid: 5a6cdadb9ab41ea4ba36eb4aee8c3c1a, type: 2}
  - {fileID: 1991536943274124, guid: 3e50dd893fc20544981a5d6570280644, type: 2}
  - {fileID: 1498759102884562, guid: 3635a9c9bf282fa4daf3318f3f680772, type: 2}
