<svg width="64" version="1.1" xmlns="http://www.w3.org/2000/svg" height="64" viewBox="0 0 64 64" xmlns:xlink="http://www.w3.org/1999/xlink" enable-background="new 0 0 64 64">
  <g>
    <path fill="currentColor" d="M44.152,32.024L15.824,60.353c-0.787,0.787-0.787,2.062,0,2.849c0.394,0.394,0.909,0.59,1.424,0.59   c0.515,0,1.031-0.196,1.424-0.59l29.736-29.736c0.557-0.557,0.718-1.439,0.445-2.177c-0.101-0.272-0.26-0.519-0.464-0.725   L18.652,0.828c-0.787-0.787-2.062-0.787-2.848,0c-0.787,0.787-0.787,2.061,0,2.848L44.152,32.024z"/>
  </g>
</svg>
