{
  "openapi" : "3.0.0",
  "info" : {
    "description" : "Отвечает за учет курьеров, деспетчеризацию доставкуов, доставку",
    "title" : "Swagger Delivery",
    "version" : "1.0.0"
  },
  "servers" : [ {
    "url" : "/"
  } ],
  "paths" : {
    "/api/v1/health" : {
      "get" : {
        "description" : "Позволяет проверить работоспособность сервиса",
        "operationId" : "Health",
        "responses" : {
          "200" : {
            "content" : {
              "application/json" : {
                "schema" : {
                  "$ref" : "#/components/schemas/Health_200_response"
                }
              }
            },
            "description" : "OK. Сервис работает исправно"
          },
          "default" : {
            "content" : {
              "application/json" : {
                "schema" : {
                  "$ref" : "#/components/schemas/Error"
                }
              }
            },
            "description" : "Ошибка"
          }
        },
        "summary" : "Вернуть статус сервиса"
      }
    },
    "/api/v1/orders" : {
      "post" : {
        "description" : "Позволяет создать заказ с целью тестирования",
        "operationId" : "CreateOrder",
        "responses" : {
          "201" : {
            "description" : "Успешный ответ"
          },
          "default" : {
            "content" : {
              "application/json" : {
                "schema" : {
                  "$ref" : "#/components/schemas/Error"
                }
              }
            },
            "description" : "Ошибка"
          }
        },
        "summary" : "Создать заказ"
      }
    },
    "/api/v1/orders/active" : {
      "get" : {
        "description" : "Позволяет получить все актуальные заказы",
        "operationId" : "GetActiveOrders",
        "responses" : {
          "200" : {
            "content" : {
              "application/json" : {
                "schema" : {
                  "items" : {
                    "$ref" : "#/components/schemas/Order"
                  },
                  "type" : "array"
                }
              }
            },
            "description" : "Успешный ответ"
          },
          "default" : {
            "content" : {
              "application/json" : {
                "schema" : {
                  "$ref" : "#/components/schemas/Error"
                }
              }
            },
            "description" : "Ошибка"
          }
        },
        "summary" : "Получить все актуальные заказы"
      }
    },
    "/api/v1/couriers" : {
      "post" : {
        "description" : "Позволяет создать курьера и затем вывести на работу",
        "operationId" : "CreateCourier",
        "responses" : {
          "201" : {
            "description" : "Успешный ответ"
          },
          "default" : {
            "content" : {
              "application/json" : {
                "schema" : {
                  "$ref" : "#/components/schemas/Error"
                }
              }
            },
            "description" : "Ошибка"
          }
        },
        "summary" : "Добавить курьера"
      }
    },
    "/api/v1/couriers/" : {
      "get" : {
        "description" : "Позволяет получить всех курьеров",
        "operationId" : "GetAllCouriers",
        "responses" : {
          "200" : {
            "content" : {
              "application/json" : {
                "schema" : {
                  "items" : {
                    "$ref" : "#/components/schemas/Courier"
                  },
                  "type" : "array"
                }
              }
            },
            "description" : "Успешный ответ"
          },
          "default" : {
            "content" : {
              "application/json" : {
                "schema" : {
                  "$ref" : "#/components/schemas/Error"
                }
              }
            },
            "description" : "Ошибка"
          }
        },
        "summary" : "Получить всех курьеров"
      }
    },
    "/api/v1/couriers/{courierId}/start-work" : {
      "post" : {
        "description" : "Позволяет курьеру начать работать",
        "operationId" : "StartWork",
        "parameters" : [ {
          "description" : "Идентификатор курьера",
          "explode" : false,
          "in" : "path",
          "name" : "courierId",
          "required" : true,
          "schema" : {
            "format" : "uuid",
            "type" : "string"
          },
          "style" : "simple"
        } ],
        "responses" : {
          "200" : {
            "description" : "Успешный ответ"
          },
          "default" : {
            "content" : {
              "application/json" : {
                "schema" : {
                  "$ref" : "#/components/schemas/Error"
                }
              }
            },
            "description" : "Ошибка"
          }
        },
        "summary" : "Начать работать"
      }
    },
    "/api/v1/couriers/{courierId}/stop-work" : {
      "post" : {
        "description" : "Позволяет курьеру закончить работать",
        "operationId" : "StopWork",
        "parameters" : [ {
          "description" : "Идентификатор курьера",
          "explode" : false,
          "in" : "path",
          "name" : "courierId",
          "required" : true,
          "schema" : {
            "format" : "uuid",
            "type" : "string"
          },
          "style" : "simple"
        } ],
        "responses" : {
          "200" : {
            "description" : "Успешный ответ"
          },
          "default" : {
            "content" : {
              "application/json" : {
                "schema" : {
                  "$ref" : "#/components/schemas/Error"
                }
              }
            },
            "description" : "Ошибка"
          }
        },
        "summary" : "Закончить работать"
      }
    }
  },
  "components" : {
    "schemas" : {
      "Location" : {
        "allOf" : [ {
          "properties" : {
            "x" : {
              "description" : "X",
              "type" : "integer"
            },
            "y" : {
              "description" : "Y",
              "type" : "integer"
            }
          },
          "required" : [ "x", "y" ]
        } ],
        "example" : {
          "x" : 0,
          "y" : 6
        }
      },
      "Order" : {
        "allOf" : [ {
          "properties" : {
            "id" : {
              "description" : "Идентификатор",
              "format" : "uuid",
              "type" : "string"
            },
            "location" : {
              "$ref" : "#/components/schemas/Location"
            }
          },
          "required" : [ "id", "location" ]
        } ],
        "example" : {
          "location" : {
            "x" : 0,
            "y" : 6
          },
          "id" : "046b6c7f-0b8a-43b9-b35d-6489e6daee91"
        }
      },
      "Courier" : {
        "allOf" : [ {
          "properties" : {
            "id" : {
              "description" : "Идентификатор",
              "format" : "uuid",
              "type" : "string"
            },
            "location" : {
              "$ref" : "#/components/schemas/Location"
            },
            "status" : {
              "description" : "Статус",
              "enum" : [ "not-available", "ready", "busy" ],
              "type" : "string"
            }
          },
          "required" : [ "id", "location", "status" ]
        } ],
        "example" : {
          "location" : {
            "x" : 0,
            "y" : 6
          },
          "id" : "046b6c7f-0b8a-43b9-b35d-6489e6daee91",
          "status" : "not-available"
        }
      },
      "Error" : {
        "example" : {
          "code" : 0,
          "message" : "message"
        },
        "properties" : {
          "code" : {
            "description" : "Код ошибки",
            "format" : "int32",
            "type" : "integer"
          },
          "message" : {
            "description" : "Текст ошибки",
            "type" : "string"
          }
        },
        "required" : [ "code", "message" ]
      },
      "Health_200_response" : {
        "example" : {
          "result" : "ok"
        },
        "properties" : {
          "result" : {
            "example" : "ok",
            "type" : "string"
          }
        },
        "type" : "object"
      }
    }
  }
}
