{
  "$schema": "https://json.schemastore.org/launchsettings.json",
  "profiles": {
    "DeliveryApp": {
      "commandName": "Project",
      "launchBrowser": false,
      "applicationUrl": "http://localhost:8089",
      "environmentVariables": {
        "PORT": "8089",
        "ASPNETCORE_ENVIRONMENT": "Development",
        "CONNECTION_STRING": "Server=localhost;Port=5432;User Id=username;Password=secret;Database=delivery;",        
      }
    }
  }
}