1
840

93.54	2.59	718.73	629.86	
148.11	4.84	684.7	618.06	
2.64	1.32	583.55	505.76	
-	0.01	367.88	-	
-	-	771	732	

15	10
15	5
15	2.5
15	1.25
15	0.75
15	0.375
15	-17
15	7.5
15	3.75
15	1.875
15	0.96
15	0.48
15	0.24
15	-13
15	5
15	2.5
15	1.25
15	0.75
15	0.375
15	0.1875
15	-8.5
15	3.5
15	1.75
15	0.9
15	0.45
15	0.22
15	0.11
