1
771

95.54	3	718.73	629.86	
130.11	5.5	684.7	618.06	
3	1.32	583.55	505.76	
-	0.01	367.88	-	
-	-	771	732	

0.000014	0.40037812
0.0000168	0.40037812
0.00002016	0.40037812
0.00002419	0.40037811
0.00002903	0.4003781
0.00003484	0.40037809
0.0000418	0.40037809
0.00005016	0.40037808
0.0000602	0.40037807
0.00007224	0.40037805
0.00008668	0.40037804
0.00010402	0.40037801
0.00012483	0.40037799
0.00014979	0.40037796
0.00017975	0.40037792
0.0002157	0.40037788
0.00025884	0.40037783
0.00031061	0.40037776
0.00037273	0.40037769
0.00044727	0.4003776
0.00053673	0.40037749
0.00064407	0.40037736
0.00077289	0.40037721
0.00092746	0.40037702
0.00111296	0.4003768
0.00133555	0.40037653
0.00160266	0.40037621
0.00192319	0.40037582
0.00230783	0.40037536
0.00276939	0.4003748
0.00332327	0.40037414
0.00398792	0.40037334
0.00478551	0.40037237
0.00574261	0.40037122
0.00689113	0.40036984
0.00826936	0.40036818
0.00992323	0.40036619
0.01190787	0.4003638
0.01428945	0.40036093
0.01714733	0.40035749
0.0205768	0.40035336
0.02469216	0.4003484
0.02963059	0.40034245
0.03555671	0.40033531
0.04266806	0.40032675
0.05120167	0.40031647
0.061442	0.40030414
0.0737304	0.40028934
0.08847648	0.40027159
0.10617178	0.40025028
0.12740613	0.40022471
0.15288736	0.40019403
0.18346483	0.40015722
0.2201578	0.40011306
0.26418936	0.40006006
0.31702723	0.39999647
0.38043268	0.39992019
0.45651921	0.39982866
0.54782306	0.39971885
0.65738767	0.39958713
0.7888652	0.39942911
0.94663824	0.39923958
1.13596589	0.39901226
1.36315907	0.39873964
1.63579088	0.39841275
1.96294906	0.39802083
2.35553887	0.39755104
2.82664664	0.39698803
3.39197597	0.39631347
4.07037116	0.39550552
4.8844454	0.39453815
5.86133448	0.39338044
7.03360137	0.39199569
8.44032165	0.39034043
10.12838598	0.38836338
12.15406317	0.38600416
14.5848758	0.38319206
17.50185097	0.37984465
21.00222116	0.37586643
25.20266539	0.37114768
30.24319847	0.36556352
36.29183816	0.35897363
43.55020579	0.35122279
52.26024695	0.34214297
62.71229634	0.33155732
75.25475561	0.31928711
90.30570673	0.30516235
108.36684808	0.28903715
130.0402177	0.27081055
156.04826124	0.25045321
187.25791349	0.22803918
224.70949618	0.2037806
269.65139542	0.17806023
