module gitlab.com/anton.kravtsov.31/vk-probation-bot/server

go 1.20

require (
	github.com/go-telegram-bot-api/telegram-bot-api/v5 v5.5.1
	github.com/jackc/pgx/v5 v5.3.1
)

require (
	github.com/jackc/pgpassfile v1.0.0 // indirect
	github.com/jackc/pgservicefile v0.0.0-20221227161230-091c0ba34f0a // indirect
	golang.org/x/crypto v0.6.0 // indirect
	golang.org/x/text v0.7.0 // indirect
)
