<?xml version="1.0" encoding="iso-8859-1"?>
<!-- Generator: Adobe Illustrator 19.0.0, SVG Export Plug-In . SVG Version: 6.00 Build 0)  -->
<svg version="1.1" id="Layer_1" xmlns="http://www.w3.org/2000/svg" xmlns:xlink="http://www.w3.org/1999/xlink" x="0px" y="0px"
	 viewBox="0 0 426.67 426.67" style="enable-background:new 0 0 426.67 426.67;" xml:space="preserve">
<path style="fill:#0c74e2;" d="M153.504,366.839c-8.657,0-17.323-3.302-23.927-9.911L9.914,237.265
	c-13.218-13.218-13.218-34.645,0-47.863c13.218-13.218,34.645-13.218,47.863,0l95.727,95.727l215.39-215.386
	c13.218-13.214,34.65-13.218,47.859,0c13.222,13.218,13.222,34.65,0,47.863L177.436,356.928
	C170.827,363.533,162.165,366.839,153.504,366.839z"/>
<g>
</g>
<g>
</g>
<g>
</g>
<g>
</g>
<g>
</g>
<g>
</g>
<g>
</g>
<g>
</g>
<g>
</g>
<g>
</g>
<g>
</g>
<g>
</g>
<g>
</g>
<g>
</g>
<g>
</g>
</svg>
