<svg width="24" height="24" viewBox="0 0 24 24" fill="none" xmlns="http://www.w3.org/2000/svg">
<path fill-rule="evenodd" clip-rule="evenodd" d="M8.875 2.75C6.45875 2.75 4.5 4.70875 4.5 7.125C4.5 9.54125 6.45875 11.5 8.875 11.5C11.2912 11.5 13.25 9.54125 13.25 7.125C13.25 4.70875 11.2912 2.75 8.875 2.75ZM6.25 7.125C6.25 5.67525 7.42525 4.5 8.875 4.5C10.3247 4.5 11.5 5.67525 11.5 7.125C11.5 8.57475 10.3247 9.75 8.875 9.75C7.42525 9.75 6.25 8.57475 6.25 7.125Z" fill="#FFB929"/>
<path d="M5.375 13.25C4.21468 13.25 3.10188 13.7109 2.28141 14.5314C1.46094 15.3519 1 16.4647 1 17.625V19.375C1 19.8583 1.39175 20.25 1.875 20.25C2.35825 20.25 2.75 19.8583 2.75 19.375V17.625C2.75 16.9288 3.02656 16.2611 3.51884 15.7688C4.01113 15.2766 4.67881 15 5.375 15H12.375C13.0712 15 13.7389 15.2766 14.2312 15.7688C14.7234 16.2611 15 16.9288 15 17.625V19.375C15 19.8583 15.3918 20.25 15.875 20.25C16.3582 20.25 16.75 19.8583 16.75 19.375V17.625C16.75 16.4647 16.2891 15.3519 15.4686 14.5314C14.6481 13.7109 13.5353 13.25 12.375 13.25H5.375Z" fill="#FFB929"/>
<path d="M17.6528 14.0197C17.7736 13.5518 18.2508 13.2705 18.7187 13.3913C19.6573 13.6336 20.4888 14.1808 21.0827 14.9469C21.6766 15.7131 21.9992 16.6547 22 17.6241V19.3747C22 19.858 21.6082 20.2497 21.125 20.2497C20.6417 20.2497 20.25 19.858 20.25 19.3747V17.6254C20.2495 17.0439 20.0559 16.4787 19.6996 16.0191C19.3433 15.5594 18.8444 15.2311 18.2812 15.0857C17.8133 14.9649 17.5319 14.4876 17.6528 14.0197Z" fill="#FFB929"/>
<path d="M15.2172 2.89084C14.7491 2.77097 14.2724 3.05331 14.1526 3.52146C14.0327 3.98961 14.315 4.46628 14.7832 4.58615C15.3478 4.73072 15.8483 5.05911 16.2057 5.51954C16.5631 5.97997 16.7571 6.54626 16.7571 7.12912C16.7571 7.71198 16.5631 8.27826 16.2057 8.73869C15.8483 9.19913 15.3478 9.52751 14.7832 9.67209C14.315 9.79195 14.0327 10.2686 14.1526 10.7368C14.2724 11.2049 14.7491 11.4873 15.2172 11.3674C16.1583 11.1264 16.9924 10.5791 17.5881 9.81175C18.1838 9.04436 18.5071 8.10055 18.5071 7.12912C18.5071 6.15768 18.1838 5.21387 17.5881 4.44649C16.9924 3.6791 16.1583 3.13179 15.2172 2.89084Z" fill="#FFB929"/>
</svg>
