<svg width="18" height="14" viewBox="0 0 18 14" fill="none" xmlns="http://www.w3.org/2000/svg">
<path fill-rule="evenodd" clip-rule="evenodd" d="M10.4712 10.7392V11.0876C10.4712 11.3356 10.2644 11.5367 10.0117 11.5367H7.98591C7.73355 11.5367 7.52884 11.3356 7.52884 11.0876V10.7392H0.182508C0.0827752 10.7392 0 10.8205 0 10.9185V12.6764C0 13.32 0.53299 13.8462 1.19034 13.8462H16.8097C17.4646 13.8462 18 13.32 18 12.6764V10.9185C18 10.8205 17.9172 10.7392 17.8151 10.7392H10.4712ZM18 10.0463V3.52562C18 2.8824 17.4646 2.35623 16.8097 2.35623H1.19034C0.53299 2.35623 0 2.8824 0 3.52562V10.0463C0 10.1443 0.0827752 10.2257 0.182508 10.2257H7.52884V9.8773C7.52884 9.62929 7.73355 9.42811 7.98591 9.42811H10.0117C10.2644 9.42811 10.4712 9.62929 10.4712 9.8773V10.2257H17.8151C17.9176 10.2257 18 10.1443 18 10.0463ZM6.4237 1.27018V1.84316H5.58788V1.16741C5.58788 0.523786 6.12127 0 6.77579 0H11.2173C11.8723 0 12.4053 0.523786 12.4053 1.16741V1.84316H11.5739V1.27018C11.5739 1.02178 11.3696 0.820994 11.1168 0.820994H6.88037C6.63003 0.820994 6.4233 1.02178 6.4233 1.27018H6.4237Z" fill="#85714D"/>
</svg>
