<svg width="24" height="24" viewBox="0 0 24 24" fill="none" xmlns="http://www.w3.org/2000/svg">
<path d="M18.8544 12.0252C18.6794 12.0252 18.5044 11.9552 18.3644 11.8327L11.5044 5.13017L4.64439 11.8327C4.36439 12.0952 3.92688 12.0952 3.64688 11.8152C3.38438 11.5352 3.38439 11.0977 3.66439 10.8177L11.0144 3.64267C11.2944 3.38017 11.7144 3.38017 11.9944 3.64267L19.3444 10.8177C19.6244 11.0802 19.6244 11.5352 19.3619 11.8152C19.2219 11.9552 19.0294 12.0252 18.8544 12.0252ZM17.3144 18.8502V12.0077C17.3144 11.6227 16.9994 11.3077 16.6144 11.3077C16.2294 11.3077 15.9144 11.6227 15.9144 12.0077V18.1502H13.7269V14.4052C13.7269 13.8977 13.3069 13.4777 12.7994 13.4777H10.1919C9.68439 13.4777 9.26439 13.8977 9.26439 14.4052V18.1502H7.07689V12.0077C7.07689 11.6227 6.76189 11.3077 6.37689 11.3077C5.99189 11.3077 5.67689 11.6227 5.67689 12.0077V18.8502C5.67689 19.2352 5.99189 19.5502 6.37689 19.5502H9.96439C10.3494 19.5502 10.6644 19.2352 10.6644 18.8502V14.8777H12.3269V18.8502C12.3269 19.2352 12.6419 19.5502 13.0269 19.5502H16.6144C17.0169 19.5502 17.3144 19.2352 17.3144 18.8502Z" fill="#A1A1A1"/>
</svg>
