{
  "files": {
    "main.css": "/static/css/main.a3773d22.css",
    "main.js": "/static/js/main.d5d31be4.js",
    "static/media/people1.png": "/static/media/people1.9cc48d22f986d05adb3f.png",
    "static/media/Play-Bold.woff": "/static/media/Play-Bold.e1fc76a42ac13cafba9d.woff",
    "static/media/Play-Regular.woff": "/static/media/Play-Regular.035cee6263e05557e56e.woff",
    "static/media/Play-Bold.woff2": "/static/media/Play-Bold.878846c9db44d6b02edd.woff2",
    "static/media/atom.png": "/static/media/atom.d3aeb1e85ac13e150be0.png",
    "static/media/net.png": "/static/media/net.68a433fa7b86fa65e088.png",
    "static/media/Play-Regular.woff2": "/static/media/Play-Regular.dc71e69863c63ee83df2.woff2",
    "static/media/device1.png": "/static/media/device1.2d757c54654800d3f985.png",
    "static/media/people3.png": "/static/media/people3.227c12cc9e1d92870504.png",
    "static/media/client1.svg": "/static/media/client1.5824db20dfaaa226378607438fee933f.svg",
    "static/media/people2.png": "/static/media/people2.4267e3a02c5f1d2652dc.png",
    "static/media/client2.png": "/static/media/client2.f056a62ec6f91af30792.png",
    "static/media/redHatch.svg": "/static/media/redHatch.0070fb83639019638a4a5303b2279f40.svg",
    "static/media/icon2.svg": "/static/media/icon2.e6d4143401333550697b80f4533ea541.svg",
    "static/media/icon3.svg": "/static/media/icon3.4c6d32aa2877155cdaae4e5c605d2f06.svg",
    "static/media/icon1.svg": "/static/media/icon1.288e4279cccc970a529063cd4b4ca64c.svg",
    "static/media/icon4.svg": "/static/media/icon4.694af363e7a5833f09e762145751f989.svg",
    "static/media/add.svg": "/static/media/add.6f30ab07aac2e069ad034d173494e618.svg",
    "index.html": "/index.html",
    "static/media/arrow.svg": "/static/media/arrow.b7346e0a16615919dedc8bb5ef09d30f.svg",
    "static/media/greyLine1.svg": "/static/media/greyLine1.f94582082bdaed7afd1b6818a3e60e71.svg",
    "static/media/gray-corner4.svg": "/static/media/gray-corner4.bda8cbf3244973bd74255f896d15992f.svg",
    "static/media/gray-corner2.svg": "/static/media/gray-corner2.0f11db6dffac9c7f01410d6ffd83dad8.svg",
    "static/media/gray-corner3.svg": "/static/media/gray-corner3.551a577333e2a6ba944ba07411c308b4.svg",
    "static/media/gray-corner1.svg": "/static/media/gray-corner1.e05641b7d012f9a9378585cca1b1c869.svg",
    "static/media/grayLine2.svg": "/static/media/grayLine2.a49ee9fea04a9bc61e445bfe64decaa0.svg",
    "static/media/grayLine1.svg": "/static/media/grayLine1.e14edf560f8f0a113cdcadbbffac145a.svg",
    "main.a3773d22.css.map": "/static/css/main.a3773d22.css.map",
    "main.d5d31be4.js.map": "/static/js/main.d5d31be4.js.map"
  },
  "entrypoints": [
    "static/css/main.a3773d22.css",
    "static/js/main.d5d31be4.js"
  ]
}