<svg width="99" height="92" viewBox="0 0 99 92" fill="none" xmlns="http://www.w3.org/2000/svg">
<path d="M5.5 0V87H99" stroke="#526595"/>
<rect x="0.5" y="-0.5" width="10" height="10" transform="matrix(1 0 0 -1 0 91)" stroke="#526595"/>
</svg>
