<svg width="115" height="115" viewBox="0 0 115 115" fill="none" xmlns="http://www.w3.org/2000/svg">
<path d="M105.417 71.8751H95.8333V57.5001C95.8333 56.2293 95.3285 55.0105 94.4299 54.1119C93.5313 53.2132 92.3125 52.7084 91.0417 52.7084H62.2917V43.1251H71.875C73.1458 43.1251 74.3646 42.6202 75.2632 41.7216C76.1618 40.823 76.6667 39.6042 76.6667 38.3334V9.58341C76.6667 8.31259 76.1618 7.09381 75.2632 6.19519C74.3646 5.29658 73.1458 4.79175 71.875 4.79175H43.125C41.8542 4.79175 40.6354 5.29658 39.7368 6.19519C38.8382 7.09381 38.3333 8.31259 38.3333 9.58341V38.3334C38.3333 39.6042 38.8382 40.823 39.7368 41.7216C40.6354 42.6202 41.8542 43.1251 43.125 43.1251H52.7083V52.7084H23.9583C22.6875 52.7084 21.4687 53.2132 20.5701 54.1119C19.6715 55.0105 19.1667 56.2293 19.1667 57.5001V71.8751H9.58332C8.31249 71.8751 7.09371 72.3799 6.1951 73.2785C5.29649 74.1771 4.79166 75.3959 4.79166 76.6667V105.417C4.79166 106.688 5.29649 107.906 6.1951 108.805C7.09371 109.704 8.31249 110.208 9.58332 110.208H38.3333C39.6042 110.208 40.8229 109.704 41.7215 108.805C42.6202 107.906 43.125 106.688 43.125 105.417V76.6667C43.125 75.3959 42.6202 74.1771 41.7215 73.2785C40.8229 72.3799 39.6042 71.8751 38.3333 71.8751H28.75V62.2917H86.25V71.8751H76.6667C75.3958 71.8751 74.177 72.3799 73.2784 73.2785C72.3798 74.1771 71.875 75.3959 71.875 76.6667V105.417C71.875 106.688 72.3798 107.906 73.2784 108.805C74.177 109.704 75.3958 110.208 76.6667 110.208H105.417C106.687 110.208 107.906 109.704 108.805 108.805C109.703 107.906 110.208 106.688 110.208 105.417V76.6667C110.208 75.3959 109.703 74.1771 108.805 73.2785C107.906 72.3799 106.687 71.8751 105.417 71.8751ZM33.5417 81.4584V100.625H14.375V81.4584H33.5417ZM47.9167 33.5417V14.3751H67.0833V33.5417H47.9167ZM100.625 100.625H81.4583V81.4584H100.625V100.625Z" fill="#FB1A50"/>
</svg>
