<?xml version="1.0" encoding="UTF-8"?>
<svg width="35px" height="35px" viewBox="0 0 35 35" version="1.1" xmlns="http://www.w3.org/2000/svg" xmlns:xlink="http://www.w3.org/1999/xlink">
    <!-- Generator: sketchtool 49.3 (51167) - http://www.bohemiancoding.com/sketch -->
    <title>4A9A1085-DA59-4CE4-B25C-7D75EB839F84</title>
    <desc>Created with sketchtool.</desc>
    <defs></defs>
    <g id="Symbols" stroke="none" stroke-width="1" fill="none" fill-rule="evenodd">
        <g id="footer" transform="translate(-909.000000, -107.000000)" fill="#9DA0B0" fill-rule="nonzero">
            <g id="footer-top">
                <g>
                    <g id="follow" transform="translate(811.000000, 63.000000)">
                        <path d="M115.5,44 C105.835624,44 98,51.8356244 98,61.5 C98,71.1643756 105.835624,79 115.5,79 C125.164376,79 133,71.1643756 133,61.5 C133,51.8334656 125.164376,44 115.5,44 Z M124.206249,57.5712142 L124.219346,58.1290358 C124.219346,63.8252644 119.885938,70.3878004 111.960581,70.3878004 C109.528099,70.3878004 107.263999,69.6746924 105.356525,68.451831 C105.693435,68.4911923 106.03682,68.5130676 106.384667,68.5130676 C108.403748,68.5130676 110.260923,67.8239938 111.735279,66.6689892 C109.849681,66.6340174 108.259328,65.3871219 107.710285,63.6765263 C107.974948,63.7268253 108.241842,63.7509313 108.521832,63.7509313 C108.915589,63.7509313 109.296177,63.7006324 109.65712,63.6021933 C107.686179,63.2040474 106.200885,61.4650282 106.200885,59.3781621 L106.200885,59.3234737 C106.782741,59.6472146 107.44555,59.8397034 108.15211,59.8638094 C106.997105,59.0916236 106.235857,57.7725538 106.235857,56.2784811 C106.235857,55.4888094 106.448062,54.7494367 106.817713,54.1128925 C108.941782,56.7203778 112.118026,58.4353628 115.698965,58.6147552 C115.62456,58.2997212 115.587429,57.9694321 115.587429,57.6325947 C115.587429,55.2548007 117.516779,53.3253795 119.896803,53.3253795 C121.13492,53.3253795 122.254953,53.8481575 123.042394,54.6859693 C124.022396,54.4912499 124.94555,54.1325371 125.778973,53.6403415 C125.45739,54.6466081 124.774937,55.4909682 123.884595,56.0246838 C124.753061,55.9218552 125.586484,55.6877745 126.35867,55.3465476 C125.781203,56.2083936 125.048379,56.967483 124.206249,57.5712142 Z" id="twitter"></path>
                    </g>
                </g>
            </g>
        </g>
    </g>
</svg>