<?xml version="1.0" encoding="UTF-8"?>
<svg width="22px" height="21px" viewBox="0 0 20 19" version="1.1" xmlns="http://www.w3.org/2000/svg" xmlns:xlink="http://www.w3.org/1999/xlink">
    <!-- Generator: Sketch 49.3 (51167) - http://www.bohemiancoding.com/sketch -->
    <title>search</title>
    <desc>Created with Sketch.</desc>
    <defs></defs>
    <g id="Page-1" stroke="none" stroke-width="1" fill="none" fill-rule="evenodd">
        <g id="search" fill="#474B62" fill-rule="nonzero">
            <path d="M11.378,4.084 C13.06,5.682 13.34,8.168 12.032,10.121 L11.471,10.921 L10.63,11.453 C9.789,11.986 8.854,12.253 7.826,12.253 C6.50597449,12.2431258 5.23825158,11.7356796 4.276,10.832 C3.34,9.944 2.78,8.7 2.78,7.458 C2.78,6.215 3.34,4.972 4.275,4.084 C5.22803365,3.16544914 6.50239039,2.65584999 7.826,2.664 C9.135,2.664 10.443,3.196 11.378,4.084 Z M2.313,2.22 C-0.771,5.15 -0.771,9.855 2.313,12.696 C3.808,14.116 5.864,14.916 7.826,14.916 C9.322,14.916 10.816,14.472 12.126,13.673 L17.731,19 L19.974,16.87 L14.367,11.542 C16.423,8.612 16.049,4.706 13.339,2.22 C11.845,0.71 9.789,0 7.826,0 C5.771,0 3.808,0.71 2.313,2.22 Z" id="Shape"></path>
        </g>
    </g>
</svg>