{
	"info": {
		"_postman_id": "287b5b02-4530-4222-9123-006fbc8726d6",
		"name": "TestPart7",
		"schema": "https://schema.getpostman.com/json/collection/v2.1.0/collection.json"
	},
	"item": [
		{
			"name": "http://localhost:8080/Articles/",
			"event": [
				{
					"listen": "test",
					"script": {
						"exec": [
							"pm.test(\"Status test\", function () {\r",
							"    pm.response.to.have.status(200);\r",
							"});"
						],
						"type": "text/javascript"
					}
				}
			],
			"protocolProfileBehavior": {
				"disableBodyPruning": true
			},
			"request": {
				"method": "GET",
				"header": [],
				"body": {
					"mode": "raw",
					"raw": "{\r\n \"id\": 4,\r\n \"nom\": \"Poney en bois cracheur de feu\",\r\n \"prix\": 0,\r\n \"prixAchat\": 0\r\n}",
					"options": {
						"raw": {
							"language": "json"
						}
					}
				},
				"url": {
					"raw": "http://localhost:8080/ArticlesOrderBy",
					"protocol": "http",
					"host": [
						"localhost"
					],
					"port": "8080",
					"path": [
						"ArticlesOrderBy"
					]
				},
				"description": "Screen all the product in alphabetic order"
			},
			"response": []
		},
		{
			"name": "http://localhost:8080/AdminArticles/1",
			"event": [
				{
					"listen": "test",
					"script": {
						"exec": [
							"pm.test(\"Status test\", function () {\r",
							"    pm.response.to.have.status(200);\r",
							"});"
						],
						"type": "text/javascript"
					}
				}
			],
			"protocolProfileBehavior": {
				"disableBodyPruning": true
			},
			"request": {
				"method": "GET",
				"header": [],
				"body": {
					"mode": "raw",
					"raw": "{\r\n \"id\": 4,\r\n \"nom\": \"Poney en bois cracheur de feu\",\r\n \"prix\": 0,\r\n \"prixAchat\": 0\r\n}",
					"options": {
						"raw": {
							"language": "json"
						}
					}
				},
				"url": {
					"raw": "http://localhost:8080/AdminArticles/1",
					"protocol": "http",
					"host": [
						"localhost"
					],
					"port": "8080",
					"path": [
						"AdminArticles",
						"1"
					]
				},
				"description": "Show the difference between prix and prix achat."
			},
			"response": []
		},
		{
			"name": "http://localhost:8080/Articles",
			"event": [
				{
					"listen": "test",
					"script": {
						"exec": [
							"pm.test(\"Status test\", function () {\r",
							"    pm.response.to.have.status(206);\r",
							"});"
						],
						"type": "text/javascript"
					}
				}
			],
			"request": {
				"method": "POST",
				"header": [],
				"body": {
					"mode": "raw",
					"raw": "{\r\n \"id\": 4,\r\n \"nom\": \"Poney en bois cracheur de feu\",\r\n \"prix\": 0,\r\n \"prixAchat\": 0\r\n}",
					"options": {
						"raw": {
							"language": "json"
						}
					}
				},
				"url": {
					"raw": "http://localhost:8080/Articles",
					"protocol": "http",
					"host": [
						"localhost"
					],
					"port": "8080",
					"path": [
						"Articles"
					]
				},
				"description": "Try to post a product with price == 0 . Expected : return error."
			},
			"response": []
		}
	]
}