{
    "order_id": "7",
    "sale_id": "7",
    "unique_order_id": "2022-02-1-9",
    "shop_id": "1",
    "vendor_id": "1",
    "customer_id": "0",
    "user_id": "1",
    "date_time": "2022-02-15 14:05:39",
    "created_at": "2022-02-15 14:04:02",
    "completed_at": "2022-02-15 14:05:39",
    "store_id": "1",
    "unique_sale_id": "2022-02-1-7",
    "currency": "EUR",
    "total": "315.00",
    "billing_address": "0",
    "shipping_address": "0",
    "payment": "CB",
    "without_taxes": "0",
    "prices_without_taxes": "0",
    "ressource_id": "0",
    "points": "0",
    "sale_ext_ref": "",
    "service_charge": "0.00",
    "guests_number": "0",
    "takeaway": "0",
    "shipping_ref": "",
    "customs_duty": "0.00",
    "vat_number": "",
    "date_z": "20220215",
    "pickup_date": "0000-00-00 00:00:00",
    "cash_tendered": "0.00",
    "completed_at_date": "2022-02-15",
    "created_at_date": "2022-02-15",
    "created_at_date_yyyy": "2022",
    "created_at_date_mm": "02",
    "created_at_date_dd": "15",
    "completed_at_date_yyyy": "2022",
    "completed_at_date_mm": "02",
    "completed_at_date_dd": "15",
    "date_z_yyyy": "2022",
    "date_z_mm": "02",
    "date_z_dd": "15",
    "pickup_date_yyyy": "0000",
    "pickup_date_mm": "00",
    "pickup_date_dd": "00",
    "pickup_date_hh": "00",
    "pickup_date_min": "00",
    "pickup_date_ss": "00",
    "pickup_date_utc": "0000-00-00 00:00:00",
    "current_date": "2022-02-15",
    "current_date_yyyy": "2022",
    "current_date_mm": "02",
    "current_date_dd": "15",
    "line_items[0][product_id]": "5",
    "line_items[0][product_size]": "0",
    "line_items[0][quantity]": "1",
    "line_items[0][product_price]": "350.00",
    "line_items[0][product_currency]": "EUR",
    "line_items[0][vat]": "0.200",
    "line_items[0][package]": "0",
    "line_items[0][points]": "0",
    "line_items[0][discount]": "0.00",
    "line_items[0][stock_withdrawal]": "1",
    "line_items[0][credit_note]": "0",
    "line_items[0][credit_note_id]": "0",
    "line_items[0][product_comments]": "",
    "line_items[0][serial_number]": "",
    "line_items[0][line_item_id_return]": "0",
    "line_items[0][date_return]": "0",
    "line_items[0][kitchen_pos]": "1",
    "line_items[0][product_supply_price]": "0.00",
    "line_items[0][line_item_id]": "10",
    "line_items[0][detail_commande_id]": "10",
    "line_items[0][item_unit_net_wo_discount]": "291.67",
    "line_items[0][item_unit_gross_wo_discount]": "350.00",
    "line_items[0][item_unit_discount_net]": "0.00",
    "line_items[0][item_unit_discount_gross]": "0.00",
    "line_items[0][item_unit_net]": "291.67",
    "line_items[0][item_unit_tax]": "58.33",
    "line_items[0][item_unit_gross]": "350.00",
    "line_items[0][item_discount_net]": "0.00",
    "line_items[0][item_discount_tax]": "0.00",
    "line_items[0][item_discount_gross]": "0.00",
    "line_items[0][item_discount_percentage]": "0.00",
    "line_items[0][item_total_net]": "291.67",
    "line_items[0][item_total_gross]": "350.00",
    "line_items[0][item_total_tax]": "58.33",
    "line_items[0][tax_label]": "Taux normal 20%",
    "line_items[0][tax_value]": "20",
    "line_items[0][product_model]": "dokoboard",
    "line_items[0][product_barcode]": "2430000000058",
    "line_items[0][product_brand]": "0",
    "line_items[0][product_supplier]": "0",
    "line_items[0][product_category]": "0",
    "line_items[0][product_size_type]": "0",
    "line_items[0][product_package]": "0",
    "line_items[0][product_stock_management]": "1",
    "line_items[0][product_supplier_reference]": "",
    "line_items[0][product_desc]": "",
    "line_items[0][storage_location]": "",
    "line_items[0][product_arch]": "0",
    "line_items[0][products_ref_ext]": "",
    "line_items[0][product_display_www]": "0",
    "line_items[0][accounting_account]": "",
    "line_items[0][misc_decimal]": "0.00",
    "line_items[0][misc_int]": "0",
    "line_items[0][misc_varchar]": "",
    "line_items[0][misc_varchar2]": "",
    "line_items[0][misc_text]": "",
    "line_items[0][multiple]": "1",
    "line_items[0][tags]": "",
    "line_items[0][modifiers]": "",
    "line_items[0][modifiers_conc]": "",
    "line_items[0][multiple_quantity]": "1",
    "line_items[0][multiple_product_price]": "350",
    "line_items[0][item_discount_percentage_round_0]": "0",
    "line_items[1][product_id]": "0",
    "line_items[1][product_size]": "0",
    "line_items[1][quantity]": "1",
    "line_items[1][product_price]": "-35.00",
    "line_items[1][product_currency]": "EUR",
    "line_items[1][vat]": "0.200",
    "line_items[1][package]": "0",
    "line_items[1][points]": "0",
    "line_items[1][discount]": "0.00",
    "line_items[1][stock_withdrawal]": "1",
    "line_items[1][credit_note]": "0",
    "line_items[1][credit_note_id]": "0",
    "line_items[1][product_comments]": "",
    "line_items[1][serial_number]": "",
    "line_items[1][line_item_id_return]": "0",
    "line_items[1][date_return]": "0",
    "line_items[1][kitchen_pos]": "1",
    "line_items[1][product_supply_price]": "0.00",
    "line_items[1][line_item_id]": "11",
    "line_items[1][detail_commande_id]": "11",
    "line_items[1][item_unit_net_wo_discount]": "-29.17",
    "line_items[1][item_unit_gross_wo_discount]": "-35.00",
    "line_items[1][item_unit_discount_net]": "0.00",
    "line_items[1][item_unit_discount_gross]": "0.00",
    "line_items[1][item_unit_net]": "-29.17",
    "line_items[1][item_unit_tax]": "-5.83",
    "line_items[1][item_unit_gross]": "-35.00",
    "line_items[1][item_discount_net]": "0.00",
    "line_items[1][item_discount_tax]": "0.00",
    "line_items[1][item_discount_gross]": "0.00",
    "line_items[1][item_discount_percentage]": "0.00",
    "line_items[1][item_total_net]": "-29.17",
    "line_items[1][item_total_gross]": "-35.00",
    "line_items[1][item_total_tax]": "-5.83",
    "line_items[1][tax_label]": "Taux normal 20%",
    "line_items[1][tax_value]": "20",
    "line_items[1][product_model]": "Discount / Credit / Unknown product / Gift voucher",
    "line_items[1][multiple_quantity]": "1",
    "line_items[1][multiple_product_price]": "-35",
    "line_items[1][item_discount_percentage_round_0]": "0",
    "sale_total_net": "262.50",
    "sale_total_tax": "52.50",
    "sale_total_gross": "315.00",
    "sale_total_quantity": "2",
    "sale_total_discount_net": "0.00",
    "sale_total_discount_tax": "0.00",
    "sale_total_discount_gross": "0.00",
    "taxes[0][tax_value]": "0.200",
    "taxes[0][tax_value_p]": "20%",
    "taxes[0][tax_label]": "Taux normal 20%",
    "taxes[0][tax_accounting_account]": "",
    "taxes[0][total_net]": "262.50",
    "taxes[0][total_vat]": "52.50",
    "taxes[0][total_gross]": "315.00",
    "sale_tags": "",
    "closed_day": "0",
    "payment_accounting_account": "",
    "vendor_last_name": "Decultot",
    "vendor_first_name": "Charles-Henri",
    "warehouse_id": "1",
    "cmd": "hiboutik.webhooks.pos_invoice_webhook"
}