{
 "actions": [],
 "allow_rename": 1,
 "creation": "2022-02-07 18:48:13.016564",
 "doctype": "DocType",
 "editable_grid": 1,
 "engine": "InnoDB",
 "field_order": [
  "hiboutik_rate",
  "hiboutik_id",
  "item_tax_template"
 ],
 "fields": [
  {
   "fieldname": "hiboutik_rate",
   "fieldtype": "Float",
   "in_list_view": 1,
   "label": "Hiboutik Rate",
   "reqd": 1
  },
  {
   "fieldname": "item_tax_template",
   "fieldtype": "Link",
   "in_list_view": 1,
   "label": "Item Tax Template",
   "options": "Item Tax Template"
  },
  {
   "fieldname": "hiboutik_id",
   "fieldtype": "Data",
   "label": "Hiboutik Tax ID",
   "read_only": 1
  }
 ],
 "index_web_pages_for_search": 1,
 "istable": 1,
 "links": [],
 "modified": "2022-02-09 17:52:33.103469",
 "modified_by": "Administrator",
 "module": "Hiboutik",
 "name": "Hiboutik VAT Rates",
 "owner": "Administrator",
 "permissions": [],
 "sort_field": "modified",
 "sort_order": "DESC"
}