{
 "actions": [],
 "allow_copy": 1,
 "creation": "2018-10-05 11:26:04.601113",
 "doctype": "DocType",
 "editable_grid": 1,
 "engine": "InnoDB",
 "field_order": [
  "route",
  "user"
 ],
 "fields": [
  {
   "fieldname": "route",
   "fieldtype": "Data",
   "in_list_view": 1,
   "label": "Route",
   "no_copy": 1,
   "read_only": 1
  },
  {
   "fieldname": "user",
   "fieldtype": "Link",
   "in_list_view": 1,
   "in_standard_filter": 1,
   "label": "User",
   "no_copy": 1,
   "options": "User",
   "read_only": 1
  }
 ],
 "in_create": 1,
 "links": [],
 "modified": "2024-03-23 16:03:37.217673",
 "modified_by": "Administrator",
 "module": "Desk",
 "name": "Route History",
 "owner": "Administrator",
 "permissions": [
  {
   "email": 1,
   "export": 1,
   "print": 1,
   "read": 1,
   "report": 1,
   "role": "System Manager",
   "share": 1
  }
 ],
 "sort_field": "creation",
 "sort_order": "DESC",
 "states": [],
 "title_field": "route"
}
