{
 "allow_comments": 0,
 "allow_delete": 0,
 "allow_edit": 0,
 "allow_incomplete": 0,
 "allow_multiple": 0,
 "allow_print": 0,
 "apply_document_permissions": 0,
 "breadcrumbs": "",
 "button_label": "Send",
 "client_script": "",
 "creation": "2019-01-24 16:19:26.886096",
 "doc_type": "Personal Data Download Request",
 "docstatus": 0,
 "doctype": "Web Form",
 "idx": 0,
 "introduction_text": "<div class=\"ql-editor read-mode\"><p>Request a file containing your personally identifiable information (PII) that is saved on our system. The file will be in JSON format and is sent to you by email. If you would like to have your PII deleted from our system, please make a <a href=\"/request-to-delete-data\" rel=\"noopener noreferrer\">request to delete data</a>.</p></div>",
 "is_multi_step_form": 0,
 "is_standard": 1,
 "list_columns": [],
 "login_required": 0,
 "max_attachment_size": 0,
 "modified": "2023-11-27 14:31:20.581478",
 "modified_by": "Administrator",
 "module": "Website",
 "name": "request-data",
 "owner": "Administrator",
 "payment_button_label": "Buy Now",
 "published": 1,
 "route": "request-data",
 "route_to_success_link": 1,
 "show_attachments": 0,
 "show_list": 0,
 "show_sidebar": 0,
 "success_message": "A download link with your data will be sent to the email address associated with your account.",
 "success_url": "/",
 "title": "Personal Data Download Request",
 "web_form_fields": [
  {
   "allow_read_on_all_link_options": 0,
   "fieldname": "user",
   "fieldtype": "Data",
   "hidden": 0,
   "label": "Email",
   "max_length": 0,
   "max_value": 0,
   "options": "",
   "read_only": 0,
   "reqd": 1,
   "show_in_filter": 0
  }
 ]
}
