{
 "actions": [],
 "autoname": "prompt",
 "creation": "2023-03-20 22:36:45.058045",
 "default_view": "List",
 "doctype": "DocType",
 "editable_grid": 1,
 "engine": "InnoDB",
 "field_order": [
  "campaign_description"
 ],
 "fields": [
  {
   "allow_in_quick_entry": 1,
   "fieldname": "campaign_description",
   "fieldtype": "Small Text",
   "in_filter": 1,
   "in_list_view": 1,
   "label": "Campaign Description (Optional)"
  }
 ],
 "index_web_pages_for_search": 1,
 "links": [],
 "modified": "2024-03-23 16:03:29.592624",
 "modified_by": "Administrator",
 "module": "Website",
 "name": "Marketing Campaign",
 "naming_rule": "Set by user",
 "owner": "Administrator",
 "permissions": [
  {
   "create": 1,
   "delete": 1,
   "email": 1,
   "export": 1,
   "print": 1,
   "read": 1,
   "report": 1,
   "role": "System Manager",
   "share": 1,
   "write": 1
  },
  {
   "create": 1,
   "delete": 1,
   "email": 1,
   "export": 1,
   "print": 1,
   "read": 1,
   "report": 1,
   "role": "Newsletter Manager",
   "share": 1,
   "write": 1
  },
  {
   "role": "Desk User",
   "select": 1
  }
 ],
 "quick_entry": 1,
 "sort_field": "creation",
 "sort_order": "DESC",
 "states": []
}
