{
 "actions": [],
 "allow_rename": 1,
 "creation": "2024-04-19 17:02:48.566902",
 "doctype": "DocType",
 "editable_grid": 1,
 "engine": "InnoDB",
 "field_order": [
  "title",
  "occurrences"
 ],
 "fields": [
  {
   "fieldname": "title",
   "fieldtype": "Data",
   "in_list_view": 1,
   "label": "Title"
  },
  {
   "fieldname": "occurrences",
   "fieldtype": "Int",
   "in_list_view": 1,
   "label": "Occurrences"
  }
 ],
 "index_web_pages_for_search": 1,
 "is_virtual": 1,
 "istable": 1,
 "links": [],
 "modified": "2024-04-19 17:10:43.199907",
 "modified_by": "Administrator",
 "module": "Desk",
 "name": "System Health Report Errors",
 "owner": "Administrator",
 "permissions": [],
 "sort_field": "creation",
 "sort_order": "DESC",
 "states": []
}
