@startuml

title __NFA035's Class Diagram__\n

  namespace fr.cnam.foad.nfa035.badges.wallet.dao {
    class fr.cnam.foad.nfa035.badges.wallet.dao.BadgeWalletDAO {
    }
  }
  

  namespace fr.cnam.foad.nfa035.badges.wallet.dao {
    class fr.cnam.foad.nfa035.badges.wallet.dao.BadgeWalletDAOTest {
    }
  }
  

  namespace fr.cnam.foad.nfa035.fileutils.simpleaccess {
    interface fr.cnam.foad.nfa035.fileutils.simpleaccess.ImageSerializer {
    }
  }
  

  namespace fr.cnam.foad.nfa035.fileutils.simpleaccess {
    class fr.cnam.foad.nfa035.fileutils.simpleaccess.ImageSerializerBase64Impl {
    }
  }
  

  namespace fr.cnam.foad.nfa035.fileutils.simpleaccess {
    namespace test {
      class fr.cnam.foad.nfa035.fileutils.simpleaccess.test.SimpleAccessTest {
      }
    }
  }
  

  namespace fr.cnam.foad.nfa035.fileutils.streaming.media {
    abstract class fr.cnam.foad.nfa035.fileutils.streaming.media.AbstractImageFrameMedia {
    }
  }
  

  namespace fr.cnam.foad.nfa035.fileutils.streaming.media {
    class fr.cnam.foad.nfa035.fileutils.streaming.media.ImageByteArrayFrame {
    }
  }
  

  namespace fr.cnam.foad.nfa035.fileutils.streaming.media {
    class fr.cnam.foad.nfa035.fileutils.streaming.media.ImageFileFrame {
    }
  }
  

  namespace fr.cnam.foad.nfa035.fileutils.streaming.serializer {
    abstract class fr.cnam.foad.nfa035.fileutils.streaming.serializer.AbstractStreamingImageDeserializer {
    }
  }
  

  namespace fr.cnam.foad.nfa035.fileutils.streaming.serializer {
    abstract class fr.cnam.foad.nfa035.fileutils.streaming.serializer.AbstractStreamingImageSerializer {
    }
  }
  

  namespace fr.cnam.foad.nfa035.fileutils.streaming.serializer {
    class fr.cnam.foad.nfa035.fileutils.streaming.serializer.ImageDeserializerBase64StreamingImpl {
    }
  }
  

  namespace fr.cnam.foad.nfa035.fileutils.streaming.serializer {
    class fr.cnam.foad.nfa035.fileutils.streaming.serializer.ImageSerializerBase64StreamingImpl {
    }
  }
  

  namespace fr.cnam.foad.nfa035.fileutils.streaming.serializer {
    interface fr.cnam.foad.nfa035.fileutils.streaming.serializer.ImageStreamingDeserializer {
    }
  }
  

  namespace fr.cnam.foad.nfa035.fileutils.streaming.serializer {
    interface fr.cnam.foad.nfa035.fileutils.streaming.serializer.ImageStreamingSerializer {
    }
  }
  

  namespace fr.cnam.foad.nfa035.fileutils.streaming.test {
    class fr.cnam.foad.nfa035.fileutils.streaming.test.StreamingTest {
    }
  }
  

  fr.cnam.foad.nfa035.fileutils.simpleaccess.ImageSerializerBase64Impl .up.|> fr.cnam.foad.nfa035.fileutils.simpleaccess.ImageSerializer
  fr.cnam.foad.nfa035.fileutils.streaming.media.AbstractImageFrameMedia o-- T : channel
  fr.cnam.foad.nfa035.fileutils.streaming.media.ImageByteArrayFrame -up-|> fr.cnam.foad.nfa035.fileutils.streaming.media.AbstractImageFrameMedia
  fr.cnam.foad.nfa035.fileutils.streaming.media.ImageFileFrame -up-|> fr.cnam.foad.nfa035.fileutils.streaming.media.AbstractImageFrameMedia
  fr.cnam.foad.nfa035.fileutils.streaming.serializer.AbstractStreamingImageDeserializer .up.|> fr.cnam.foad.nfa035.fileutils.streaming.serializer.ImageStreamingDeserializer
  fr.cnam.foad.nfa035.fileutils.streaming.serializer.AbstractStreamingImageSerializer .up.|> fr.cnam.foad.nfa035.fileutils.streaming.serializer.ImageStreamingSerializer
  fr.cnam.foad.nfa035.fileutils.streaming.serializer.ImageDeserializerBase64StreamingImpl -up-|> fr.cnam.foad.nfa035.fileutils.streaming.serializer.AbstractStreamingImageDeserializer
  fr.cnam.foad.nfa035.fileutils.streaming.serializer.ImageSerializerBase64StreamingImpl -up-|> fr.cnam.foad.nfa035.fileutils.streaming.serializer.AbstractStreamingImageSerializer


right footer


PlantUML diagram generated by SketchIt! (https://bitbucket.org/pmesmeur/sketch.it)
For more information about this tool, please contact philippe.mesmeur@gmail.com
endfooter

@enduml
