@startuml

title __DAO's Class Diagram__\n

  namespace fr.cnam.foad.nfa035.badges.wallet.dao {
    class fr.cnam.foad.nfa035.badges.wallet.dao.BadgeWalletDAO {
        {static} - LOG : Logger
        - media : ImageFileFrame
        - walletDatabase : File
        + BadgeWalletDAO()
        + addBadge()
        + getBadge()
    }
  }
  



right footer


PlantUML diagram generated by SketchIt! (https://bitbucket.org/pmesmeur/sketch.it)
For more information about this tool, please contact philippe.mesmeur@gmail.com
endfooter

@enduml
