// =============================================================================
// Scilab ( https://www.scilab.org/ ) - This file is part of Scilab
// Copyright (C) 2015 - Scilab Enterprises - Paul Bignier
//
//  This file is distributed under the same license as the Scilab package.
// =============================================================================
// <-- CLI SHELL MODE -->
loadXcosLibs();
scicos_log("TRACE");
d = scicos_diagram();
Xcos info:    objectCreated( 1 , DIAGRAM )
Xcos trace:   objectReferenced( 1 , DIAGRAM ) : 1
Xcos trace:   propertyUpdated( 1 , DIAGRAM , TITLE ) : NO_CHANGES
Xcos trace:   propertyUpdated( 1 , DIAGRAM , PATH ) : NO_CHANGES
Xcos trace:   propertyUpdated( 1 , DIAGRAM , PROPERTIES ) : NO_CHANGES
Xcos trace:   propertyUpdated( 1 , DIAGRAM , PROPERTIES ) : NO_CHANGES
Xcos trace:   propertyUpdated( 1 , DIAGRAM , CONTEXT ) : NO_CHANGES
Xcos trace:   objectUnreferenced( 1 , DIAGRAM ) : 0
Xcos trace:   propertyUpdated( 1 , DIAGRAM , CHILDREN ) : NO_CHANGES
Xcos debug:   propertyUpdated( 1 , DIAGRAM , VERSION_NUMBER ) : SUCCESS
d.objs(1) = BIGSOM_f("define");
Xcos info:    objectCreated( 2 , BLOCK )
Xcos trace:   objectReferenced( 2 , BLOCK ) : 1
Xcos trace:   propertyUpdated( 2 , BLOCK , GEOMETRY ) : NO_CHANGES
Xcos debug:   propertyUpdated( 2 , BLOCK , GEOMETRY ) : SUCCESS
Xcos debug:   propertyUpdated( 2 , BLOCK , EXPRS ) : SUCCESS
Xcos info:    objectCreated( 3 , PORT )
Xcos debug:   propertyUpdated( 3 , PORT , SOURCE_BLOCK ) : SUCCESS
Xcos debug:   propertyUpdated( 3 , PORT , PORT_KIND ) : SUCCESS
Xcos trace:   propertyUpdated( 3 , PORT , CONNECTED_SIGNALS ) : NO_CHANGES
Xcos info:    objectCreated( 4 , PORT )
Xcos debug:   propertyUpdated( 4 , PORT , SOURCE_BLOCK ) : SUCCESS
Xcos debug:   propertyUpdated( 4 , PORT , PORT_KIND ) : SUCCESS
Xcos trace:   propertyUpdated( 4 , PORT , CONNECTED_SIGNALS ) : NO_CHANGES
Xcos debug:   propertyUpdated( 2 , BLOCK , INPUTS ) : SUCCESS
Xcos info:    objectCreated( 5 , PORT )
Xcos debug:   propertyUpdated( 5 , PORT , SOURCE_BLOCK ) : SUCCESS
Xcos debug:   propertyUpdated( 5 , PORT , PORT_KIND ) : SUCCESS
Xcos trace:   propertyUpdated( 5 , PORT , CONNECTED_SIGNALS ) : NO_CHANGES
Xcos debug:   propertyUpdated( 2 , BLOCK , OUTPUTS ) : SUCCESS
Xcos trace:   propertyUpdated( 2 , BLOCK , DESCRIPTION ) : NO_CHANGES
Xcos trace:   propertyUpdated( 3 , PORT , IMPLICIT ) : NO_CHANGES
Xcos trace:   propertyUpdated( 4 , PORT , IMPLICIT ) : NO_CHANGES
Xcos trace:   propertyUpdated( 5 , PORT , IMPLICIT ) : NO_CHANGES
Xcos trace:   propertyUpdated( 3 , PORT , STYLE ) : NO_CHANGES
Xcos trace:   propertyUpdated( 4 , PORT , STYLE ) : NO_CHANGES
Xcos trace:   propertyUpdated( 5 , PORT , STYLE ) : NO_CHANGES
Xcos trace:   propertyUpdated( 3 , PORT , LABEL ) : NO_CHANGES
Xcos trace:   propertyUpdated( 4 , PORT , LABEL ) : NO_CHANGES
Xcos trace:   propertyUpdated( 5 , PORT , LABEL ) : NO_CHANGES
Xcos trace:   propertyUpdated( 2 , BLOCK , STYLE ) : NO_CHANGES
Xcos trace:   objectUnreferenced( 2 , BLOCK ) : 0
Xcos trace:   objectReferenced( 2 , BLOCK ) : 1
Xcos debug:   propertyUpdated( 2 , BLOCK , SIM_FUNCTION_NAME ) : SUCCESS
Xcos debug:   propertyUpdated( 2 , BLOCK , SIM_FUNCTION_API ) : SUCCESS
Xcos debug:   propertyUpdated( 3 , PORT , DATATYPE ) : SUCCESS
Xcos debug:   propertyUpdated( 4 , PORT , DATATYPE ) : SUCCESS
Xcos debug:   propertyUpdated( 5 , PORT , DATATYPE ) : SUCCESS
Xcos trace:   propertyUpdated( 2 , BLOCK , STATE ) : NO_CHANGES
Xcos trace:   propertyUpdated( 2 , BLOCK , DSTATE ) : NO_CHANGES
Xcos trace:   propertyUpdated( 2 , BLOCK , ODSTATE ) : NO_CHANGES
Xcos debug:   propertyUpdated( 2 , BLOCK , RPAR ) : SUCCESS
Xcos trace:   propertyUpdated( 2 , BLOCK , IPAR ) : NO_CHANGES
Xcos trace:   propertyUpdated( 2 , BLOCK , OPAR ) : NO_CHANGES
Xcos trace:   propertyUpdated( 2 , BLOCK , SIM_BLOCKTYPE ) : NO_CHANGES
Xcos debug:   propertyUpdated( 2 , BLOCK , SIM_DEP_UT ) : SUCCESS
Xcos trace:   propertyUpdated( 2 , BLOCK , DESCRIPTION ) : NO_CHANGES
Xcos trace:   propertyUpdated( 2 , BLOCK , NZCROSS ) : NO_CHANGES
Xcos trace:   propertyUpdated( 2 , BLOCK , NMODE ) : NO_CHANGES
Xcos trace:   propertyUpdated( 2 , BLOCK , EQUATIONS ) : NO_CHANGES
Xcos trace:   propertyUpdated( 2 , BLOCK , UID ) : NO_CHANGES
Xcos trace:   objectUnreferenced( 2 , BLOCK ) : 0
Xcos debug:   propertyUpdated( 2 , BLOCK , INTERFACE_FUNCTION ) : SUCCESS
Xcos info:    objectCreated( 6 , BLOCK )
Xcos info:    objectCloned( 2 , 6 , BLOCK )
Xcos debug:   propertyUpdated( 6 , BLOCK , SIM_FUNCTION_API ) : SUCCESS
Xcos trace:   propertyUpdated( 6 , BLOCK , DESCRIPTION ) : NO_CHANGES
Xcos debug:   propertyUpdated( 6 , BLOCK , INTERFACE_FUNCTION ) : SUCCESS
Xcos debug:   propertyUpdated( 6 , BLOCK , SIM_FUNCTION_NAME ) : SUCCESS
Xcos trace:   propertyUpdated( 6 , BLOCK , SIM_BLOCKTYPE ) : NO_CHANGES
Xcos trace:   propertyUpdated( 6 , BLOCK , UID ) : NO_CHANGES
Xcos trace:   propertyUpdated( 6 , BLOCK , STYLE ) : NO_CHANGES
Xcos debug:   propertyUpdated( 6 , BLOCK , GEOMETRY ) : SUCCESS
Xcos debug:   propertyUpdated( 6 , BLOCK , EXPRS ) : SUCCESS
Xcos trace:   propertyUpdated( 6 , BLOCK , STATE ) : NO_CHANGES
Xcos trace:   propertyUpdated( 6 , BLOCK , DSTATE ) : NO_CHANGES
Xcos trace:   propertyUpdated( 6 , BLOCK , ODSTATE ) : NO_CHANGES
Xcos debug:   propertyUpdated( 6 , BLOCK , RPAR ) : SUCCESS
Xcos trace:   propertyUpdated( 6 , BLOCK , OPAR ) : NO_CHANGES
Xcos trace:   propertyUpdated( 6 , BLOCK , EQUATIONS ) : NO_CHANGES
Xcos debug:   propertyUpdated( 6 , BLOCK , SIM_DEP_UT ) : SUCCESS
Xcos trace:   propertyUpdated( 6 , BLOCK , NZCROSS ) : NO_CHANGES
Xcos trace:   propertyUpdated( 6 , BLOCK , NMODE ) : NO_CHANGES
Xcos trace:   propertyUpdated( 6 , BLOCK , IPAR ) : NO_CHANGES
Xcos trace:   propertyUpdated( 6 , BLOCK , COLOR ) : NO_CHANGES
Xcos trace:   propertyUpdated( 6 , BLOCK , CONTEXT ) : NO_CHANGES
Xcos trace:   propertyUpdated( 6 , BLOCK , PARENT_DIAGRAM ) : NO_CHANGES
Xcos info:    objectCreated( 7 , PORT )
Xcos info:    objectCloned( 3 , 7 , PORT )
Xcos trace:   propertyUpdated( 7 , PORT , FIRING ) : NO_CHANGES
Xcos debug:   propertyUpdated( 7 , PORT , PORT_KIND ) : SUCCESS
Xcos trace:   propertyUpdated( 7 , PORT , IMPLICIT ) : NO_CHANGES
Xcos trace:   propertyUpdated( 7 , PORT , UID ) : NO_CHANGES
Xcos trace:   propertyUpdated( 7 , PORT , STYLE ) : NO_CHANGES
Xcos trace:   propertyUpdated( 7 , PORT , LABEL ) : NO_CHANGES
Xcos debug:   propertyUpdated( 7 , PORT , DATATYPE ) : SUCCESS
Xcos debug:   propertyUpdated( 7 , PORT , SOURCE_BLOCK ) : SUCCESS
Xcos trace:   propertyUpdated( 7 , PORT , CONNECTED_SIGNALS ) : NO_CHANGES
Xcos info:    objectCreated( 8 , PORT )
Xcos info:    objectCloned( 4 , 8 , PORT )
Xcos trace:   propertyUpdated( 8 , PORT , FIRING ) : NO_CHANGES
Xcos debug:   propertyUpdated( 8 , PORT , PORT_KIND ) : SUCCESS
Xcos trace:   propertyUpdated( 8 , PORT , IMPLICIT ) : NO_CHANGES
Xcos trace:   propertyUpdated( 8 , PORT , UID ) : NO_CHANGES
Xcos trace:   propertyUpdated( 8 , PORT , STYLE ) : NO_CHANGES
Xcos trace:   propertyUpdated( 8 , PORT , LABEL ) : NO_CHANGES
Xcos debug:   propertyUpdated( 8 , PORT , DATATYPE ) : SUCCESS
Xcos debug:   propertyUpdated( 8 , PORT , SOURCE_BLOCK ) : SUCCESS
Xcos trace:   propertyUpdated( 8 , PORT , CONNECTED_SIGNALS ) : NO_CHANGES
Xcos debug:   propertyUpdated( 6 , BLOCK , INPUTS ) : SUCCESS
Xcos info:    objectCreated( 9 , PORT )
Xcos info:    objectCloned( 5 , 9 , PORT )
Xcos trace:   propertyUpdated( 9 , PORT , FIRING ) : NO_CHANGES
Xcos debug:   propertyUpdated( 9 , PORT , PORT_KIND ) : SUCCESS
Xcos trace:   propertyUpdated( 9 , PORT , IMPLICIT ) : NO_CHANGES
Xcos trace:   propertyUpdated( 9 , PORT , UID ) : NO_CHANGES
Xcos trace:   propertyUpdated( 9 , PORT , STYLE ) : NO_CHANGES
Xcos trace:   propertyUpdated( 9 , PORT , LABEL ) : NO_CHANGES
Xcos debug:   propertyUpdated( 9 , PORT , DATATYPE ) : SUCCESS
Xcos debug:   propertyUpdated( 9 , PORT , SOURCE_BLOCK ) : SUCCESS
Xcos trace:   propertyUpdated( 9 , PORT , CONNECTED_SIGNALS ) : NO_CHANGES
Xcos debug:   propertyUpdated( 6 , BLOCK , OUTPUTS ) : SUCCESS
Xcos trace:   propertyUpdated( 6 , BLOCK , EVENT_INPUTS ) : NO_CHANGES
Xcos trace:   propertyUpdated( 6 , BLOCK , EVENT_OUTPUTS ) : NO_CHANGES
Xcos trace:   propertyUpdated( 6 , BLOCK , PARENT_BLOCK ) : NO_CHANGES
Xcos trace:   propertyUpdated( 7 , PORT , CONNECTED_SIGNALS ) : NO_CHANGES
Xcos trace:   propertyUpdated( 8 , PORT , CONNECTED_SIGNALS ) : NO_CHANGES
Xcos trace:   propertyUpdated( 9 , PORT , CONNECTED_SIGNALS ) : NO_CHANGES
Xcos trace:   propertyUpdated( 6 , BLOCK , CHILDREN ) : NO_CHANGES
Xcos trace:   objectReferenced( 6 , BLOCK ) : 1
Xcos debug:   propertyUpdated( 6 , BLOCK , PARENT_DIAGRAM ) : SUCCESS
Xcos trace:   propertyUpdated( 6 , BLOCK , PARENT_BLOCK ) : NO_CHANGES
Xcos debug:   propertyUpdated( 1 , DIAGRAM , CHILDREN ) : SUCCESS
Xcos trace:   objectUnreferenced( 6 , BLOCK ) : 0
Xcos debug:   propertyUpdated( 2 , BLOCK , INPUTS ) : SUCCESS
Xcos trace:   propertyUpdated( 2 , BLOCK , OUTPUTS ) : NO_CHANGES
Xcos trace:   propertyUpdated( 2 , BLOCK , EVENT_INPUTS ) : NO_CHANGES
Xcos trace:   propertyUpdated( 2 , BLOCK , EVENT_OUTPUTS ) : NO_CHANGES
Xcos info:    objectDeleted( 3 , PORT )
Xcos debug:   propertyUpdated( 2 , BLOCK , INPUTS ) : SUCCESS
Xcos trace:   propertyUpdated( 2 , BLOCK , OUTPUTS ) : NO_CHANGES
Xcos trace:   propertyUpdated( 2 , BLOCK , EVENT_INPUTS ) : NO_CHANGES
Xcos trace:   propertyUpdated( 2 , BLOCK , EVENT_OUTPUTS ) : NO_CHANGES
Xcos info:    objectDeleted( 4 , PORT )
Xcos trace:   propertyUpdated( 2 , BLOCK , INPUTS ) : NO_CHANGES
Xcos debug:   propertyUpdated( 2 , BLOCK , OUTPUTS ) : SUCCESS
Xcos trace:   propertyUpdated( 2 , BLOCK , EVENT_INPUTS ) : NO_CHANGES
Xcos trace:   propertyUpdated( 2 , BLOCK , EVENT_OUTPUTS ) : NO_CHANGES
Xcos info:    objectDeleted( 5 , PORT )
Xcos info:    objectDeleted( 2 , BLOCK )
d.objs(2) = BIGSOM_f("define");
Xcos info:    objectCreated( 10 , BLOCK )
Xcos trace:   objectReferenced( 10 , BLOCK ) : 1
Xcos trace:   propertyUpdated( 10 , BLOCK , GEOMETRY ) : NO_CHANGES
Xcos debug:   propertyUpdated( 10 , BLOCK , GEOMETRY ) : SUCCESS
Xcos debug:   propertyUpdated( 10 , BLOCK , EXPRS ) : SUCCESS
Xcos info:    objectCreated( 11 , PORT )
Xcos debug:   propertyUpdated( 11 , PORT , SOURCE_BLOCK ) : SUCCESS
Xcos debug:   propertyUpdated( 11 , PORT , PORT_KIND ) : SUCCESS
Xcos trace:   propertyUpdated( 11 , PORT , CONNECTED_SIGNALS ) : NO_CHANGES
Xcos info:    objectCreated( 12 , PORT )
Xcos debug:   propertyUpdated( 12 , PORT , SOURCE_BLOCK ) : SUCCESS
Xcos debug:   propertyUpdated( 12 , PORT , PORT_KIND ) : SUCCESS
Xcos trace:   propertyUpdated( 12 , PORT , CONNECTED_SIGNALS ) : NO_CHANGES
Xcos debug:   propertyUpdated( 10 , BLOCK , INPUTS ) : SUCCESS
Xcos info:    objectCreated( 13 , PORT )
Xcos debug:   propertyUpdated( 13 , PORT , SOURCE_BLOCK ) : SUCCESS
Xcos debug:   propertyUpdated( 13 , PORT , PORT_KIND ) : SUCCESS
Xcos trace:   propertyUpdated( 13 , PORT , CONNECTED_SIGNALS ) : NO_CHANGES
Xcos debug:   propertyUpdated( 10 , BLOCK , OUTPUTS ) : SUCCESS
Xcos trace:   propertyUpdated( 10 , BLOCK , DESCRIPTION ) : NO_CHANGES
Xcos trace:   propertyUpdated( 11 , PORT , IMPLICIT ) : NO_CHANGES
Xcos trace:   propertyUpdated( 12 , PORT , IMPLICIT ) : NO_CHANGES
Xcos trace:   propertyUpdated( 13 , PORT , IMPLICIT ) : NO_CHANGES
Xcos trace:   propertyUpdated( 11 , PORT , STYLE ) : NO_CHANGES
Xcos trace:   propertyUpdated( 12 , PORT , STYLE ) : NO_CHANGES
Xcos trace:   propertyUpdated( 13 , PORT , STYLE ) : NO_CHANGES
Xcos trace:   propertyUpdated( 11 , PORT , LABEL ) : NO_CHANGES
Xcos trace:   propertyUpdated( 12 , PORT , LABEL ) : NO_CHANGES
Xcos trace:   propertyUpdated( 13 , PORT , LABEL ) : NO_CHANGES
Xcos trace:   propertyUpdated( 10 , BLOCK , STYLE ) : NO_CHANGES
Xcos trace:   objectUnreferenced( 10 , BLOCK ) : 0
Xcos trace:   objectReferenced( 10 , BLOCK ) : 1
Xcos debug:   propertyUpdated( 10 , BLOCK , SIM_FUNCTION_NAME ) : SUCCESS
Xcos debug:   propertyUpdated( 10 , BLOCK , SIM_FUNCTION_API ) : SUCCESS
Xcos debug:   propertyUpdated( 11 , PORT , DATATYPE ) : SUCCESS
Xcos debug:   propertyUpdated( 12 , PORT , DATATYPE ) : SUCCESS
Xcos debug:   propertyUpdated( 13 , PORT , DATATYPE ) : SUCCESS
Xcos trace:   propertyUpdated( 10 , BLOCK , STATE ) : NO_CHANGES
Xcos trace:   propertyUpdated( 10 , BLOCK , DSTATE ) : NO_CHANGES
Xcos trace:   propertyUpdated( 10 , BLOCK , ODSTATE ) : NO_CHANGES
Xcos debug:   propertyUpdated( 10 , BLOCK , RPAR ) : SUCCESS
Xcos trace:   propertyUpdated( 10 , BLOCK , IPAR ) : NO_CHANGES
Xcos trace:   propertyUpdated( 10 , BLOCK , OPAR ) : NO_CHANGES
Xcos trace:   propertyUpdated( 10 , BLOCK , SIM_BLOCKTYPE ) : NO_CHANGES
Xcos debug:   propertyUpdated( 10 , BLOCK , SIM_DEP_UT ) : SUCCESS
Xcos trace:   propertyUpdated( 10 , BLOCK , DESCRIPTION ) : NO_CHANGES
Xcos trace:   propertyUpdated( 10 , BLOCK , NZCROSS ) : NO_CHANGES
Xcos trace:   propertyUpdated( 10 , BLOCK , NMODE ) : NO_CHANGES
Xcos trace:   propertyUpdated( 10 , BLOCK , EQUATIONS ) : NO_CHANGES
Xcos trace:   propertyUpdated( 10 , BLOCK , UID ) : NO_CHANGES
Xcos trace:   objectUnreferenced( 10 , BLOCK ) : 0
Xcos debug:   propertyUpdated( 10 , BLOCK , INTERFACE_FUNCTION ) : SUCCESS
Xcos trace:   objectReferenced( 6 , BLOCK ) : 1
Xcos info:    objectCreated( 14 , BLOCK )
Xcos info:    objectCloned( 10 , 14 , BLOCK )
Xcos debug:   propertyUpdated( 14 , BLOCK , SIM_FUNCTION_API ) : SUCCESS
Xcos trace:   propertyUpdated( 14 , BLOCK , DESCRIPTION ) : NO_CHANGES
Xcos debug:   propertyUpdated( 14 , BLOCK , INTERFACE_FUNCTION ) : SUCCESS
Xcos debug:   propertyUpdated( 14 , BLOCK , SIM_FUNCTION_NAME ) : SUCCESS
Xcos trace:   propertyUpdated( 14 , BLOCK , SIM_BLOCKTYPE ) : NO_CHANGES
Xcos trace:   propertyUpdated( 14 , BLOCK , UID ) : NO_CHANGES
Xcos trace:   propertyUpdated( 14 , BLOCK , STYLE ) : NO_CHANGES
Xcos debug:   propertyUpdated( 14 , BLOCK , GEOMETRY ) : SUCCESS
Xcos debug:   propertyUpdated( 14 , BLOCK , EXPRS ) : SUCCESS
Xcos trace:   propertyUpdated( 14 , BLOCK , STATE ) : NO_CHANGES
Xcos trace:   propertyUpdated( 14 , BLOCK , DSTATE ) : NO_CHANGES
Xcos trace:   propertyUpdated( 14 , BLOCK , ODSTATE ) : NO_CHANGES
Xcos debug:   propertyUpdated( 14 , BLOCK , RPAR ) : SUCCESS
Xcos trace:   propertyUpdated( 14 , BLOCK , OPAR ) : NO_CHANGES
Xcos trace:   propertyUpdated( 14 , BLOCK , EQUATIONS ) : NO_CHANGES
Xcos debug:   propertyUpdated( 14 , BLOCK , SIM_DEP_UT ) : SUCCESS
Xcos trace:   propertyUpdated( 14 , BLOCK , NZCROSS ) : NO_CHANGES
Xcos trace:   propertyUpdated( 14 , BLOCK , NMODE ) : NO_CHANGES
Xcos trace:   propertyUpdated( 14 , BLOCK , IPAR ) : NO_CHANGES
Xcos trace:   propertyUpdated( 14 , BLOCK , COLOR ) : NO_CHANGES
Xcos trace:   propertyUpdated( 14 , BLOCK , CONTEXT ) : NO_CHANGES
Xcos trace:   propertyUpdated( 14 , BLOCK , PARENT_DIAGRAM ) : NO_CHANGES
Xcos info:    objectCreated( 15 , PORT )
Xcos info:    objectCloned( 11 , 15 , PORT )
Xcos trace:   propertyUpdated( 15 , PORT , FIRING ) : NO_CHANGES
Xcos debug:   propertyUpdated( 15 , PORT , PORT_KIND ) : SUCCESS
Xcos trace:   propertyUpdated( 15 , PORT , IMPLICIT ) : NO_CHANGES
Xcos trace:   propertyUpdated( 15 , PORT , UID ) : NO_CHANGES
Xcos trace:   propertyUpdated( 15 , PORT , STYLE ) : NO_CHANGES
Xcos trace:   propertyUpdated( 15 , PORT , LABEL ) : NO_CHANGES
Xcos debug:   propertyUpdated( 15 , PORT , DATATYPE ) : SUCCESS
Xcos debug:   propertyUpdated( 15 , PORT , SOURCE_BLOCK ) : SUCCESS
Xcos trace:   propertyUpdated( 15 , PORT , CONNECTED_SIGNALS ) : NO_CHANGES
Xcos info:    objectCreated( 16 , PORT )
Xcos info:    objectCloned( 12 , 16 , PORT )
Xcos trace:   propertyUpdated( 16 , PORT , FIRING ) : NO_CHANGES
Xcos debug:   propertyUpdated( 16 , PORT , PORT_KIND ) : SUCCESS
Xcos trace:   propertyUpdated( 16 , PORT , IMPLICIT ) : NO_CHANGES
Xcos trace:   propertyUpdated( 16 , PORT , UID ) : NO_CHANGES
Xcos trace:   propertyUpdated( 16 , PORT , STYLE ) : NO_CHANGES
Xcos trace:   propertyUpdated( 16 , PORT , LABEL ) : NO_CHANGES
Xcos debug:   propertyUpdated( 16 , PORT , DATATYPE ) : SUCCESS
Xcos debug:   propertyUpdated( 16 , PORT , SOURCE_BLOCK ) : SUCCESS
Xcos trace:   propertyUpdated( 16 , PORT , CONNECTED_SIGNALS ) : NO_CHANGES
Xcos debug:   propertyUpdated( 14 , BLOCK , INPUTS ) : SUCCESS
Xcos info:    objectCreated( 17 , PORT )
Xcos info:    objectCloned( 13 , 17 , PORT )
Xcos trace:   propertyUpdated( 17 , PORT , FIRING ) : NO_CHANGES
Xcos debug:   propertyUpdated( 17 , PORT , PORT_KIND ) : SUCCESS
Xcos trace:   propertyUpdated( 17 , PORT , IMPLICIT ) : NO_CHANGES
Xcos trace:   propertyUpdated( 17 , PORT , UID ) : NO_CHANGES
Xcos trace:   propertyUpdated( 17 , PORT , STYLE ) : NO_CHANGES
Xcos trace:   propertyUpdated( 17 , PORT , LABEL ) : NO_CHANGES
Xcos debug:   propertyUpdated( 17 , PORT , DATATYPE ) : SUCCESS
Xcos debug:   propertyUpdated( 17 , PORT , SOURCE_BLOCK ) : SUCCESS
Xcos trace:   propertyUpdated( 17 , PORT , CONNECTED_SIGNALS ) : NO_CHANGES
Xcos debug:   propertyUpdated( 14 , BLOCK , OUTPUTS ) : SUCCESS
Xcos trace:   propertyUpdated( 14 , BLOCK , EVENT_INPUTS ) : NO_CHANGES
Xcos trace:   propertyUpdated( 14 , BLOCK , EVENT_OUTPUTS ) : NO_CHANGES
Xcos trace:   propertyUpdated( 14 , BLOCK , PARENT_BLOCK ) : NO_CHANGES
Xcos trace:   propertyUpdated( 15 , PORT , CONNECTED_SIGNALS ) : NO_CHANGES
Xcos trace:   propertyUpdated( 16 , PORT , CONNECTED_SIGNALS ) : NO_CHANGES
Xcos trace:   propertyUpdated( 17 , PORT , CONNECTED_SIGNALS ) : NO_CHANGES
Xcos trace:   propertyUpdated( 14 , BLOCK , CHILDREN ) : NO_CHANGES
Xcos trace:   objectReferenced( 14 , BLOCK ) : 1
Xcos debug:   propertyUpdated( 14 , BLOCK , PARENT_DIAGRAM ) : SUCCESS
Xcos trace:   propertyUpdated( 14 , BLOCK , PARENT_BLOCK ) : NO_CHANGES
Xcos debug:   propertyUpdated( 1 , DIAGRAM , CHILDREN ) : SUCCESS
Xcos trace:   objectUnreferenced( 14 , BLOCK ) : 0
Xcos trace:   objectUnreferenced( 6 , BLOCK ) : 0
Xcos debug:   propertyUpdated( 10 , BLOCK , INPUTS ) : SUCCESS
Xcos trace:   propertyUpdated( 10 , BLOCK , OUTPUTS ) : NO_CHANGES
Xcos trace:   propertyUpdated( 10 , BLOCK , EVENT_INPUTS ) : NO_CHANGES
Xcos trace:   propertyUpdated( 10 , BLOCK , EVENT_OUTPUTS ) : NO_CHANGES
Xcos info:    objectDeleted( 11 , PORT )
Xcos debug:   propertyUpdated( 10 , BLOCK , INPUTS ) : SUCCESS
Xcos trace:   propertyUpdated( 10 , BLOCK , OUTPUTS ) : NO_CHANGES
Xcos trace:   propertyUpdated( 10 , BLOCK , EVENT_INPUTS ) : NO_CHANGES
Xcos trace:   propertyUpdated( 10 , BLOCK , EVENT_OUTPUTS ) : NO_CHANGES
Xcos info:    objectDeleted( 12 , PORT )
Xcos trace:   propertyUpdated( 10 , BLOCK , INPUTS ) : NO_CHANGES
Xcos debug:   propertyUpdated( 10 , BLOCK , OUTPUTS ) : SUCCESS
Xcos trace:   propertyUpdated( 10 , BLOCK , EVENT_INPUTS ) : NO_CHANGES
Xcos trace:   propertyUpdated( 10 , BLOCK , EVENT_OUTPUTS ) : NO_CHANGES
Xcos info:    objectDeleted( 13 , PORT )
Xcos info:    objectDeleted( 10 , BLOCK )
d.objs(3) = scicos_link(from=[2 1 0],to=[2 1 1]);
Xcos info:    objectCreated( 18 , LINK )
Xcos trace:   propertyUpdated( 18 , LINK , CONTROL_POINTS ) : NO_CHANGES
Xcos trace:   propertyUpdated( 18 , LINK , CONTROL_POINTS ) : NO_CHANGES
Xcos trace:   propertyUpdated( 18 , LINK , DESCRIPTION ) : NO_CHANGES
Xcos trace:   propertyUpdated( 18 , LINK , THICK ) : NO_CHANGES
Xcos trace:   propertyUpdated( 18 , LINK , COLOR ) : NO_CHANGES
Xcos trace:   propertyUpdated( 18 , LINK , KIND ) : NO_CHANGES
Xcos trace:   objectReferenced( 6 , BLOCK ) : 1
Xcos trace:   objectReferenced( 14 , BLOCK ) : 1
Xcos info:    objectCreated( 19 , LINK )
Xcos info:    objectCloned( 18 , 19 , LINK )
Xcos trace:   propertyUpdated( 19 , LINK , COLOR ) : NO_CHANGES
Xcos trace:   propertyUpdated( 19 , LINK , KIND ) : NO_CHANGES
Xcos trace:   propertyUpdated( 19 , LINK , DESCRIPTION ) : NO_CHANGES
Xcos trace:   propertyUpdated( 19 , LINK , UID ) : NO_CHANGES
Xcos trace:   propertyUpdated( 19 , LINK , STYLE ) : NO_CHANGES
Xcos trace:   propertyUpdated( 19 , LINK , CONTROL_POINTS ) : NO_CHANGES
Xcos trace:   propertyUpdated( 19 , LINK , THICK ) : NO_CHANGES
Xcos trace:   propertyUpdated( 19 , LINK , PARENT_DIAGRAM ) : NO_CHANGES
Xcos trace:   propertyUpdated( 19 , LINK , PARENT_BLOCK ) : NO_CHANGES
Xcos trace:   propertyUpdated( 19 , LINK , SOURCE_PORT ) : NO_CHANGES
Xcos trace:   propertyUpdated( 19 , LINK , DESTINATION_PORT ) : NO_CHANGES
Xcos trace:   objectReferenced( 19 , LINK ) : 1
Xcos debug:   propertyUpdated( 19 , LINK , PARENT_DIAGRAM ) : SUCCESS
Xcos trace:   propertyUpdated( 19 , LINK , PARENT_BLOCK ) : NO_CHANGES
Xcos trace:   propertyUpdated( 17 , PORT , CONNECTED_SIGNALS ) : NO_CHANGES
Xcos debug:   propertyUpdated( 17 , PORT , CONNECTED_SIGNALS ) : SUCCESS
Xcos debug:   propertyUpdated( 19 , LINK , SOURCE_PORT ) : SUCCESS
Xcos trace:   propertyUpdated( 15 , PORT , CONNECTED_SIGNALS ) : NO_CHANGES
Xcos debug:   propertyUpdated( 15 , PORT , CONNECTED_SIGNALS ) : SUCCESS
Xcos debug:   propertyUpdated( 19 , LINK , DESTINATION_PORT ) : SUCCESS
Xcos debug:   propertyUpdated( 1 , DIAGRAM , CHILDREN ) : SUCCESS
Xcos trace:   objectUnreferenced( 19 , LINK ) : 0
Xcos trace:   objectUnreferenced( 6 , BLOCK ) : 0
Xcos trace:   objectUnreferenced( 14 , BLOCK ) : 0
Xcos info:    objectDeleted( 18 , LINK )
dClone = d;
dClone.objs(1) = d.objs(1); // Perform actual cloning
Xcos trace:   objectReferenced( 6 , BLOCK ) : 1
Xcos trace:   objectReferenced( 14 , BLOCK ) : 1
Xcos trace:   objectReferenced( 19 , LINK ) : 1
Xcos trace:   objectUnreferenced( 14 , BLOCK ) : 0
Xcos trace:   objectUnreferenced( 19 , LINK ) : 0
Xcos info:    objectCreated( 20 , DIAGRAM )
Xcos info:    objectCloned( 1 , 20 , DIAGRAM )
Xcos trace:   propertyUpdated( 20 , DIAGRAM , DEBUG_LEVEL ) : NO_CHANGES
Xcos trace:   propertyUpdated( 20 , DIAGRAM , TITLE ) : NO_CHANGES
Xcos trace:   propertyUpdated( 20 , DIAGRAM , PATH ) : NO_CHANGES
Xcos debug:   propertyUpdated( 20 , DIAGRAM , VERSION_NUMBER ) : SUCCESS
Xcos trace:   propertyUpdated( 20 , DIAGRAM , PROPERTIES ) : NO_CHANGES
Xcos trace:   propertyUpdated( 20 , DIAGRAM , COLOR ) : NO_CHANGES
Xcos trace:   propertyUpdated( 20 , DIAGRAM , CONTEXT ) : NO_CHANGES
Xcos info:    objectCreated( 21 , BLOCK )
Xcos info:    objectCloned( 6 , 21 , BLOCK )
Xcos debug:   propertyUpdated( 21 , BLOCK , SIM_FUNCTION_API ) : SUCCESS
Xcos trace:   propertyUpdated( 21 , BLOCK , DESCRIPTION ) : NO_CHANGES
Xcos debug:   propertyUpdated( 21 , BLOCK , INTERFACE_FUNCTION ) : SUCCESS
Xcos debug:   propertyUpdated( 21 , BLOCK , SIM_FUNCTION_NAME ) : SUCCESS
Xcos trace:   propertyUpdated( 21 , BLOCK , SIM_BLOCKTYPE ) : NO_CHANGES
Xcos trace:   propertyUpdated( 21 , BLOCK , UID ) : NO_CHANGES
Xcos trace:   propertyUpdated( 21 , BLOCK , STYLE ) : NO_CHANGES
Xcos debug:   propertyUpdated( 21 , BLOCK , GEOMETRY ) : SUCCESS
Xcos debug:   propertyUpdated( 21 , BLOCK , EXPRS ) : SUCCESS
Xcos trace:   propertyUpdated( 21 , BLOCK , STATE ) : NO_CHANGES
Xcos trace:   propertyUpdated( 21 , BLOCK , DSTATE ) : NO_CHANGES
Xcos trace:   propertyUpdated( 21 , BLOCK , ODSTATE ) : NO_CHANGES
Xcos debug:   propertyUpdated( 21 , BLOCK , RPAR ) : SUCCESS
Xcos trace:   propertyUpdated( 21 , BLOCK , OPAR ) : NO_CHANGES
Xcos trace:   propertyUpdated( 21 , BLOCK , EQUATIONS ) : NO_CHANGES
Xcos debug:   propertyUpdated( 21 , BLOCK , SIM_DEP_UT ) : SUCCESS
Xcos trace:   propertyUpdated( 21 , BLOCK , NZCROSS ) : NO_CHANGES
Xcos trace:   propertyUpdated( 21 , BLOCK , NMODE ) : NO_CHANGES
Xcos trace:   propertyUpdated( 21 , BLOCK , IPAR ) : NO_CHANGES
Xcos trace:   propertyUpdated( 21 , BLOCK , COLOR ) : NO_CHANGES
Xcos trace:   propertyUpdated( 21 , BLOCK , CONTEXT ) : NO_CHANGES
Xcos debug:   propertyUpdated( 21 , BLOCK , PARENT_DIAGRAM ) : SUCCESS
Xcos info:    objectCreated( 22 , PORT )
Xcos info:    objectCloned( 7 , 22 , PORT )
Xcos trace:   propertyUpdated( 22 , PORT , FIRING ) : NO_CHANGES
Xcos debug:   propertyUpdated( 22 , PORT , PORT_KIND ) : SUCCESS
Xcos trace:   propertyUpdated( 22 , PORT , IMPLICIT ) : NO_CHANGES
Xcos trace:   propertyUpdated( 22 , PORT , UID ) : NO_CHANGES
Xcos trace:   propertyUpdated( 22 , PORT , STYLE ) : NO_CHANGES
Xcos trace:   propertyUpdated( 22 , PORT , LABEL ) : NO_CHANGES
Xcos debug:   propertyUpdated( 22 , PORT , DATATYPE ) : SUCCESS
Xcos debug:   propertyUpdated( 22 , PORT , SOURCE_BLOCK ) : SUCCESS
Xcos trace:   propertyUpdated( 22 , PORT , CONNECTED_SIGNALS ) : NO_CHANGES
Xcos info:    objectCreated( 23 , PORT )
Xcos info:    objectCloned( 8 , 23 , PORT )
Xcos trace:   propertyUpdated( 23 , PORT , FIRING ) : NO_CHANGES
Xcos debug:   propertyUpdated( 23 , PORT , PORT_KIND ) : SUCCESS
Xcos trace:   propertyUpdated( 23 , PORT , IMPLICIT ) : NO_CHANGES
Xcos trace:   propertyUpdated( 23 , PORT , UID ) : NO_CHANGES
Xcos trace:   propertyUpdated( 23 , PORT , STYLE ) : NO_CHANGES
Xcos trace:   propertyUpdated( 23 , PORT , LABEL ) : NO_CHANGES
Xcos debug:   propertyUpdated( 23 , PORT , DATATYPE ) : SUCCESS
Xcos debug:   propertyUpdated( 23 , PORT , SOURCE_BLOCK ) : SUCCESS
Xcos trace:   propertyUpdated( 23 , PORT , CONNECTED_SIGNALS ) : NO_CHANGES
Xcos debug:   propertyUpdated( 21 , BLOCK , INPUTS ) : SUCCESS
Xcos info:    objectCreated( 24 , PORT )
Xcos info:    objectCloned( 9 , 24 , PORT )
Xcos trace:   propertyUpdated( 24 , PORT , FIRING ) : NO_CHANGES
Xcos debug:   propertyUpdated( 24 , PORT , PORT_KIND ) : SUCCESS
Xcos trace:   propertyUpdated( 24 , PORT , IMPLICIT ) : NO_CHANGES
Xcos trace:   propertyUpdated( 24 , PORT , UID ) : NO_CHANGES
Xcos trace:   propertyUpdated( 24 , PORT , STYLE ) : NO_CHANGES
Xcos trace:   propertyUpdated( 24 , PORT , LABEL ) : NO_CHANGES
Xcos debug:   propertyUpdated( 24 , PORT , DATATYPE ) : SUCCESS
Xcos debug:   propertyUpdated( 24 , PORT , SOURCE_BLOCK ) : SUCCESS
Xcos trace:   propertyUpdated( 24 , PORT , CONNECTED_SIGNALS ) : NO_CHANGES
Xcos debug:   propertyUpdated( 21 , BLOCK , OUTPUTS ) : SUCCESS
Xcos trace:   propertyUpdated( 21 , BLOCK , EVENT_INPUTS ) : NO_CHANGES
Xcos trace:   propertyUpdated( 21 , BLOCK , EVENT_OUTPUTS ) : NO_CHANGES
Xcos trace:   propertyUpdated( 21 , BLOCK , PARENT_BLOCK ) : NO_CHANGES
Xcos trace:   propertyUpdated( 24 , PORT , CONNECTED_SIGNALS ) : NO_CHANGES
Xcos trace:   propertyUpdated( 22 , PORT , CONNECTED_SIGNALS ) : NO_CHANGES
Xcos trace:   propertyUpdated( 23 , PORT , CONNECTED_SIGNALS ) : NO_CHANGES
Xcos trace:   propertyUpdated( 21 , BLOCK , CHILDREN ) : NO_CHANGES
Xcos info:    objectCreated( 25 , BLOCK )
Xcos info:    objectCloned( 14 , 25 , BLOCK )
Xcos debug:   propertyUpdated( 25 , BLOCK , SIM_FUNCTION_API ) : SUCCESS
Xcos trace:   propertyUpdated( 25 , BLOCK , DESCRIPTION ) : NO_CHANGES
Xcos debug:   propertyUpdated( 25 , BLOCK , INTERFACE_FUNCTION ) : SUCCESS
Xcos debug:   propertyUpdated( 25 , BLOCK , SIM_FUNCTION_NAME ) : SUCCESS
Xcos trace:   propertyUpdated( 25 , BLOCK , SIM_BLOCKTYPE ) : NO_CHANGES
Xcos trace:   propertyUpdated( 25 , BLOCK , UID ) : NO_CHANGES
Xcos trace:   propertyUpdated( 25 , BLOCK , STYLE ) : NO_CHANGES
Xcos debug:   propertyUpdated( 25 , BLOCK , GEOMETRY ) : SUCCESS
Xcos debug:   propertyUpdated( 25 , BLOCK , EXPRS ) : SUCCESS
Xcos trace:   propertyUpdated( 25 , BLOCK , STATE ) : NO_CHANGES
Xcos trace:   propertyUpdated( 25 , BLOCK , DSTATE ) : NO_CHANGES
Xcos trace:   propertyUpdated( 25 , BLOCK , ODSTATE ) : NO_CHANGES
Xcos debug:   propertyUpdated( 25 , BLOCK , RPAR ) : SUCCESS
Xcos trace:   propertyUpdated( 25 , BLOCK , OPAR ) : NO_CHANGES
Xcos trace:   propertyUpdated( 25 , BLOCK , EQUATIONS ) : NO_CHANGES
Xcos debug:   propertyUpdated( 25 , BLOCK , SIM_DEP_UT ) : SUCCESS
Xcos trace:   propertyUpdated( 25 , BLOCK , NZCROSS ) : NO_CHANGES
Xcos trace:   propertyUpdated( 25 , BLOCK , NMODE ) : NO_CHANGES
Xcos trace:   propertyUpdated( 25 , BLOCK , IPAR ) : NO_CHANGES
Xcos trace:   propertyUpdated( 25 , BLOCK , COLOR ) : NO_CHANGES
Xcos trace:   propertyUpdated( 25 , BLOCK , CONTEXT ) : NO_CHANGES
Xcos debug:   propertyUpdated( 25 , BLOCK , PARENT_DIAGRAM ) : SUCCESS
Xcos info:    objectCreated( 26 , PORT )
Xcos info:    objectCloned( 15 , 26 , PORT )
Xcos trace:   propertyUpdated( 26 , PORT , FIRING ) : NO_CHANGES
Xcos debug:   propertyUpdated( 26 , PORT , PORT_KIND ) : SUCCESS
Xcos trace:   propertyUpdated( 26 , PORT , IMPLICIT ) : NO_CHANGES
Xcos trace:   propertyUpdated( 26 , PORT , UID ) : NO_CHANGES
Xcos trace:   propertyUpdated( 26 , PORT , STYLE ) : NO_CHANGES
Xcos trace:   propertyUpdated( 26 , PORT , LABEL ) : NO_CHANGES
Xcos debug:   propertyUpdated( 26 , PORT , DATATYPE ) : SUCCESS
Xcos debug:   propertyUpdated( 26 , PORT , SOURCE_BLOCK ) : SUCCESS
Xcos trace:   propertyUpdated( 26 , PORT , CONNECTED_SIGNALS ) : NO_CHANGES
Xcos info:    objectCreated( 27 , PORT )
Xcos info:    objectCloned( 16 , 27 , PORT )
Xcos trace:   propertyUpdated( 27 , PORT , FIRING ) : NO_CHANGES
Xcos debug:   propertyUpdated( 27 , PORT , PORT_KIND ) : SUCCESS
Xcos trace:   propertyUpdated( 27 , PORT , IMPLICIT ) : NO_CHANGES
Xcos trace:   propertyUpdated( 27 , PORT , UID ) : NO_CHANGES
Xcos trace:   propertyUpdated( 27 , PORT , STYLE ) : NO_CHANGES
Xcos trace:   propertyUpdated( 27 , PORT , LABEL ) : NO_CHANGES
Xcos debug:   propertyUpdated( 27 , PORT , DATATYPE ) : SUCCESS
Xcos debug:   propertyUpdated( 27 , PORT , SOURCE_BLOCK ) : SUCCESS
Xcos trace:   propertyUpdated( 27 , PORT , CONNECTED_SIGNALS ) : NO_CHANGES
Xcos debug:   propertyUpdated( 25 , BLOCK , INPUTS ) : SUCCESS
Xcos info:    objectCreated( 28 , PORT )
Xcos info:    objectCloned( 17 , 28 , PORT )
Xcos trace:   propertyUpdated( 28 , PORT , FIRING ) : NO_CHANGES
Xcos debug:   propertyUpdated( 28 , PORT , PORT_KIND ) : SUCCESS
Xcos trace:   propertyUpdated( 28 , PORT , IMPLICIT ) : NO_CHANGES
Xcos trace:   propertyUpdated( 28 , PORT , UID ) : NO_CHANGES
Xcos trace:   propertyUpdated( 28 , PORT , STYLE ) : NO_CHANGES
Xcos trace:   propertyUpdated( 28 , PORT , LABEL ) : NO_CHANGES
Xcos debug:   propertyUpdated( 28 , PORT , DATATYPE ) : SUCCESS
Xcos debug:   propertyUpdated( 28 , PORT , SOURCE_BLOCK ) : SUCCESS
Xcos trace:   propertyUpdated( 28 , PORT , CONNECTED_SIGNALS ) : NO_CHANGES
Xcos debug:   propertyUpdated( 25 , BLOCK , OUTPUTS ) : SUCCESS
Xcos trace:   propertyUpdated( 25 , BLOCK , EVENT_INPUTS ) : NO_CHANGES
Xcos trace:   propertyUpdated( 25 , BLOCK , EVENT_OUTPUTS ) : NO_CHANGES
Xcos trace:   propertyUpdated( 25 , BLOCK , PARENT_BLOCK ) : NO_CHANGES
Xcos trace:   propertyUpdated( 28 , PORT , CONNECTED_SIGNALS ) : NO_CHANGES
Xcos trace:   propertyUpdated( 24 , PORT , CONNECTED_SIGNALS ) : NO_CHANGES
Xcos trace:   propertyUpdated( 26 , PORT , CONNECTED_SIGNALS ) : NO_CHANGES
Xcos trace:   propertyUpdated( 22 , PORT , CONNECTED_SIGNALS ) : NO_CHANGES
Xcos trace:   propertyUpdated( 27 , PORT , CONNECTED_SIGNALS ) : NO_CHANGES
Xcos trace:   propertyUpdated( 23 , PORT , CONNECTED_SIGNALS ) : NO_CHANGES
Xcos trace:   propertyUpdated( 25 , BLOCK , CHILDREN ) : NO_CHANGES
Xcos info:    objectCreated( 29 , LINK )
Xcos info:    objectCloned( 19 , 29 , LINK )
Xcos trace:   propertyUpdated( 29 , LINK , COLOR ) : NO_CHANGES
Xcos trace:   propertyUpdated( 29 , LINK , KIND ) : NO_CHANGES
Xcos trace:   propertyUpdated( 29 , LINK , DESCRIPTION ) : NO_CHANGES
Xcos trace:   propertyUpdated( 29 , LINK , UID ) : NO_CHANGES
Xcos trace:   propertyUpdated( 29 , LINK , STYLE ) : NO_CHANGES
Xcos trace:   propertyUpdated( 29 , LINK , CONTROL_POINTS ) : NO_CHANGES
Xcos trace:   propertyUpdated( 29 , LINK , THICK ) : NO_CHANGES
Xcos debug:   propertyUpdated( 29 , LINK , PARENT_DIAGRAM ) : SUCCESS
Xcos trace:   propertyUpdated( 29 , LINK , PARENT_BLOCK ) : NO_CHANGES
Xcos debug:   propertyUpdated( 29 , LINK , SOURCE_PORT ) : SUCCESS
Xcos debug:   propertyUpdated( 29 , LINK , DESTINATION_PORT ) : SUCCESS
Xcos debug:   propertyUpdated( 28 , PORT , CONNECTED_SIGNALS ) : SUCCESS
Xcos trace:   propertyUpdated( 24 , PORT , CONNECTED_SIGNALS ) : NO_CHANGES
Xcos debug:   propertyUpdated( 26 , PORT , CONNECTED_SIGNALS ) : SUCCESS
Xcos trace:   propertyUpdated( 22 , PORT , CONNECTED_SIGNALS ) : NO_CHANGES
Xcos trace:   propertyUpdated( 27 , PORT , CONNECTED_SIGNALS ) : NO_CHANGES
Xcos trace:   propertyUpdated( 23 , PORT , CONNECTED_SIGNALS ) : NO_CHANGES
Xcos trace:   propertyUpdated( 29 , LINK , SOURCE_PORT ) : NO_CHANGES
Xcos trace:   propertyUpdated( 29 , LINK , DESTINATION_PORT ) : NO_CHANGES
Xcos debug:   propertyUpdated( 20 , DIAGRAM , CHILDREN ) : SUCCESS
Xcos trace:   objectReferenced( 21 , BLOCK ) : 1
Xcos trace:   objectReferenced( 25 , BLOCK ) : 1
Xcos trace:   objectReferenced( 29 , LINK ) : 1
Xcos trace:   objectUnreferenced( 21 , BLOCK ) : 0
Xcos info:    objectCreated( 30 , BLOCK )
Xcos info:    objectCloned( 6 , 30 , BLOCK )
Xcos debug:   propertyUpdated( 30 , BLOCK , SIM_FUNCTION_API ) : SUCCESS
Xcos trace:   propertyUpdated( 30 , BLOCK , DESCRIPTION ) : NO_CHANGES
Xcos debug:   propertyUpdated( 30 , BLOCK , INTERFACE_FUNCTION ) : SUCCESS
Xcos debug:   propertyUpdated( 30 , BLOCK , SIM_FUNCTION_NAME ) : SUCCESS
Xcos trace:   propertyUpdated( 30 , BLOCK , SIM_BLOCKTYPE ) : NO_CHANGES
Xcos trace:   propertyUpdated( 30 , BLOCK , UID ) : NO_CHANGES
Xcos trace:   propertyUpdated( 30 , BLOCK , STYLE ) : NO_CHANGES
Xcos debug:   propertyUpdated( 30 , BLOCK , GEOMETRY ) : SUCCESS
Xcos debug:   propertyUpdated( 30 , BLOCK , EXPRS ) : SUCCESS
Xcos trace:   propertyUpdated( 30 , BLOCK , STATE ) : NO_CHANGES
Xcos trace:   propertyUpdated( 30 , BLOCK , DSTATE ) : NO_CHANGES
Xcos trace:   propertyUpdated( 30 , BLOCK , ODSTATE ) : NO_CHANGES
Xcos debug:   propertyUpdated( 30 , BLOCK , RPAR ) : SUCCESS
Xcos trace:   propertyUpdated( 30 , BLOCK , OPAR ) : NO_CHANGES
Xcos trace:   propertyUpdated( 30 , BLOCK , EQUATIONS ) : NO_CHANGES
Xcos debug:   propertyUpdated( 30 , BLOCK , SIM_DEP_UT ) : SUCCESS
Xcos trace:   propertyUpdated( 30 , BLOCK , NZCROSS ) : NO_CHANGES
Xcos trace:   propertyUpdated( 30 , BLOCK , NMODE ) : NO_CHANGES
Xcos trace:   propertyUpdated( 30 , BLOCK , IPAR ) : NO_CHANGES
Xcos trace:   propertyUpdated( 30 , BLOCK , COLOR ) : NO_CHANGES
Xcos trace:   propertyUpdated( 30 , BLOCK , CONTEXT ) : NO_CHANGES
Xcos trace:   propertyUpdated( 30 , BLOCK , PARENT_DIAGRAM ) : NO_CHANGES
Xcos info:    objectCreated( 31 , PORT )
Xcos info:    objectCloned( 7 , 31 , PORT )
Xcos trace:   propertyUpdated( 31 , PORT , FIRING ) : NO_CHANGES
Xcos debug:   propertyUpdated( 31 , PORT , PORT_KIND ) : SUCCESS
Xcos trace:   propertyUpdated( 31 , PORT , IMPLICIT ) : NO_CHANGES
Xcos trace:   propertyUpdated( 31 , PORT , UID ) : NO_CHANGES
Xcos trace:   propertyUpdated( 31 , PORT , STYLE ) : NO_CHANGES
Xcos trace:   propertyUpdated( 31 , PORT , LABEL ) : NO_CHANGES
Xcos debug:   propertyUpdated( 31 , PORT , DATATYPE ) : SUCCESS
Xcos debug:   propertyUpdated( 31 , PORT , SOURCE_BLOCK ) : SUCCESS
Xcos trace:   propertyUpdated( 31 , PORT , CONNECTED_SIGNALS ) : NO_CHANGES
Xcos info:    objectCreated( 32 , PORT )
Xcos info:    objectCloned( 8 , 32 , PORT )
Xcos trace:   propertyUpdated( 32 , PORT , FIRING ) : NO_CHANGES
Xcos debug:   propertyUpdated( 32 , PORT , PORT_KIND ) : SUCCESS
Xcos trace:   propertyUpdated( 32 , PORT , IMPLICIT ) : NO_CHANGES
Xcos trace:   propertyUpdated( 32 , PORT , UID ) : NO_CHANGES
Xcos trace:   propertyUpdated( 32 , PORT , STYLE ) : NO_CHANGES
Xcos trace:   propertyUpdated( 32 , PORT , LABEL ) : NO_CHANGES
Xcos debug:   propertyUpdated( 32 , PORT , DATATYPE ) : SUCCESS
Xcos debug:   propertyUpdated( 32 , PORT , SOURCE_BLOCK ) : SUCCESS
Xcos trace:   propertyUpdated( 32 , PORT , CONNECTED_SIGNALS ) : NO_CHANGES
Xcos debug:   propertyUpdated( 30 , BLOCK , INPUTS ) : SUCCESS
Xcos info:    objectCreated( 33 , PORT )
Xcos info:    objectCloned( 9 , 33 , PORT )
Xcos trace:   propertyUpdated( 33 , PORT , FIRING ) : NO_CHANGES
Xcos debug:   propertyUpdated( 33 , PORT , PORT_KIND ) : SUCCESS
Xcos trace:   propertyUpdated( 33 , PORT , IMPLICIT ) : NO_CHANGES
Xcos trace:   propertyUpdated( 33 , PORT , UID ) : NO_CHANGES
Xcos trace:   propertyUpdated( 33 , PORT , STYLE ) : NO_CHANGES
Xcos trace:   propertyUpdated( 33 , PORT , LABEL ) : NO_CHANGES
Xcos debug:   propertyUpdated( 33 , PORT , DATATYPE ) : SUCCESS
Xcos debug:   propertyUpdated( 33 , PORT , SOURCE_BLOCK ) : SUCCESS
Xcos trace:   propertyUpdated( 33 , PORT , CONNECTED_SIGNALS ) : NO_CHANGES
Xcos debug:   propertyUpdated( 30 , BLOCK , OUTPUTS ) : SUCCESS
Xcos trace:   propertyUpdated( 30 , BLOCK , EVENT_INPUTS ) : NO_CHANGES
Xcos trace:   propertyUpdated( 30 , BLOCK , EVENT_OUTPUTS ) : NO_CHANGES
Xcos trace:   propertyUpdated( 30 , BLOCK , PARENT_BLOCK ) : NO_CHANGES
Xcos trace:   propertyUpdated( 31 , PORT , CONNECTED_SIGNALS ) : NO_CHANGES
Xcos trace:   propertyUpdated( 32 , PORT , CONNECTED_SIGNALS ) : NO_CHANGES
Xcos trace:   propertyUpdated( 33 , PORT , CONNECTED_SIGNALS ) : NO_CHANGES
Xcos trace:   propertyUpdated( 30 , BLOCK , CHILDREN ) : NO_CHANGES
Xcos trace:   objectReferenced( 30 , BLOCK ) : 1
Xcos debug:   propertyUpdated( 20 , DIAGRAM , CHILDREN ) : SUCCESS
Xcos debug:   propertyUpdated( 21 , BLOCK , INPUTS ) : SUCCESS
Xcos trace:   propertyUpdated( 21 , BLOCK , OUTPUTS ) : NO_CHANGES
Xcos trace:   propertyUpdated( 21 , BLOCK , EVENT_INPUTS ) : NO_CHANGES
Xcos trace:   propertyUpdated( 21 , BLOCK , EVENT_OUTPUTS ) : NO_CHANGES
Xcos info:    objectDeleted( 22 , PORT )
Xcos debug:   propertyUpdated( 21 , BLOCK , INPUTS ) : SUCCESS
Xcos trace:   propertyUpdated( 21 , BLOCK , OUTPUTS ) : NO_CHANGES
Xcos trace:   propertyUpdated( 21 , BLOCK , EVENT_INPUTS ) : NO_CHANGES
Xcos trace:   propertyUpdated( 21 , BLOCK , EVENT_OUTPUTS ) : NO_CHANGES
Xcos info:    objectDeleted( 23 , PORT )
Xcos trace:   propertyUpdated( 21 , BLOCK , INPUTS ) : NO_CHANGES
Xcos debug:   propertyUpdated( 21 , BLOCK , OUTPUTS ) : SUCCESS
Xcos trace:   propertyUpdated( 21 , BLOCK , EVENT_INPUTS ) : NO_CHANGES
Xcos trace:   propertyUpdated( 21 , BLOCK , EVENT_OUTPUTS ) : NO_CHANGES
Xcos info:    objectDeleted( 24 , PORT )
Xcos info:    objectDeleted( 21 , BLOCK )
Xcos debug:   propertyUpdated( 30 , BLOCK , PARENT_DIAGRAM ) : SUCCESS
Xcos trace:   propertyUpdated( 30 , BLOCK , PARENT_BLOCK ) : NO_CHANGES
Xcos debug:   propertyUpdated( 20 , DIAGRAM , CHILDREN ) : SUCCESS
Xcos trace:   objectUnreferenced( 30 , BLOCK ) : 0
Xcos trace:   objectUnreferenced( 25 , BLOCK ) : 0
Xcos trace:   objectUnreferenced( 29 , LINK ) : 0
Xcos trace:   objectUnreferenced( 6 , BLOCK ) : 0
assert_checkequal(d.objs(2).graphics.pin , [3; 0]);
Xcos trace:   objectReferenced( 6 , BLOCK ) : 1
Xcos trace:   objectReferenced( 14 , BLOCK ) : 1
Xcos trace:   objectReferenced( 19 , LINK ) : 1
Xcos trace:   objectUnreferenced( 6 , BLOCK ) : 0
Xcos trace:   objectUnreferenced( 19 , LINK ) : 0
Xcos trace:   objectReferenced( 14 , BLOCK ) : 2
Xcos trace:   objectUnreferenced( 14 , BLOCK ) : 1
Xcos trace:   objectUnreferenced( 14 , BLOCK ) : 0
assert_checkequal(d.objs(2).graphics.pout,  3);
Xcos trace:   objectReferenced( 6 , BLOCK ) : 1
Xcos trace:   objectReferenced( 14 , BLOCK ) : 1
Xcos trace:   objectReferenced( 19 , LINK ) : 1
Xcos trace:   objectUnreferenced( 6 , BLOCK ) : 0
Xcos trace:   objectUnreferenced( 19 , LINK ) : 0
Xcos trace:   objectReferenced( 14 , BLOCK ) : 2
Xcos trace:   objectUnreferenced( 14 , BLOCK ) : 1
Xcos trace:   objectUnreferenced( 14 , BLOCK ) : 0
assert_checkequal(d.objs(3).from, [2 1 0]);
Xcos trace:   objectReferenced( 6 , BLOCK ) : 1
Xcos trace:   objectReferenced( 14 , BLOCK ) : 1
Xcos trace:   objectReferenced( 19 , LINK ) : 1
Xcos trace:   objectUnreferenced( 6 , BLOCK ) : 0
Xcos trace:   objectUnreferenced( 14 , BLOCK ) : 0
Xcos trace:   objectUnreferenced( 19 , LINK ) : 0
assert_checkequal(d.objs(3).to  , [2 1 1]);
Xcos trace:   objectReferenced( 6 , BLOCK ) : 1
Xcos trace:   objectReferenced( 14 , BLOCK ) : 1
Xcos trace:   objectReferenced( 19 , LINK ) : 1
Xcos trace:   objectUnreferenced( 6 , BLOCK ) : 0
Xcos trace:   objectUnreferenced( 14 , BLOCK ) : 0
Xcos trace:   objectUnreferenced( 19 , LINK ) : 0
assert_checkequal(dClone.objs(2).graphics.pin , [3; 0]);
Xcos trace:   objectReferenced( 30 , BLOCK ) : 1
Xcos trace:   objectReferenced( 25 , BLOCK ) : 1
Xcos trace:   objectReferenced( 29 , LINK ) : 1
Xcos trace:   objectUnreferenced( 30 , BLOCK ) : 0
Xcos trace:   objectUnreferenced( 29 , LINK ) : 0
Xcos trace:   objectReferenced( 25 , BLOCK ) : 2
Xcos trace:   objectUnreferenced( 25 , BLOCK ) : 1
Xcos trace:   objectUnreferenced( 25 , BLOCK ) : 0
assert_checkequal(dClone.objs(2).graphics.pout, 3);
Xcos trace:   objectReferenced( 30 , BLOCK ) : 1
Xcos trace:   objectReferenced( 25 , BLOCK ) : 1
Xcos trace:   objectReferenced( 29 , LINK ) : 1
Xcos trace:   objectUnreferenced( 30 , BLOCK ) : 0
Xcos trace:   objectUnreferenced( 29 , LINK ) : 0
Xcos trace:   objectReferenced( 25 , BLOCK ) : 2
Xcos trace:   objectUnreferenced( 25 , BLOCK ) : 1
Xcos trace:   objectUnreferenced( 25 , BLOCK ) : 0
assert_checkequal(dClone.objs(3).from, [2 1 0]);
Xcos trace:   objectReferenced( 30 , BLOCK ) : 1
Xcos trace:   objectReferenced( 25 , BLOCK ) : 1
Xcos trace:   objectReferenced( 29 , LINK ) : 1
Xcos trace:   objectUnreferenced( 30 , BLOCK ) : 0
Xcos trace:   objectUnreferenced( 25 , BLOCK ) : 0
Xcos trace:   objectUnreferenced( 29 , LINK ) : 0
assert_checkequal(dClone.objs(3).to  , [2 1 1]);
Xcos trace:   objectReferenced( 30 , BLOCK ) : 1
Xcos trace:   objectReferenced( 25 , BLOCK ) : 1
Xcos trace:   objectReferenced( 29 , LINK ) : 1
Xcos trace:   objectUnreferenced( 30 , BLOCK ) : 0
Xcos trace:   objectUnreferenced( 25 , BLOCK ) : 0
Xcos trace:   objectUnreferenced( 29 , LINK ) : 0
// Check that all the model items are freed
clear
Xcos debug:   propertyUpdated( 6 , BLOCK , PARENT_DIAGRAM ) : SUCCESS
Xcos debug:   propertyUpdated( 14 , BLOCK , PARENT_DIAGRAM ) : SUCCESS
Xcos debug:   propertyUpdated( 19 , LINK , PARENT_DIAGRAM ) : SUCCESS
Xcos debug:   propertyUpdated( 6 , BLOCK , INPUTS ) : SUCCESS
Xcos trace:   propertyUpdated( 6 , BLOCK , OUTPUTS ) : NO_CHANGES
Xcos trace:   propertyUpdated( 6 , BLOCK , EVENT_INPUTS ) : NO_CHANGES
Xcos trace:   propertyUpdated( 6 , BLOCK , EVENT_OUTPUTS ) : NO_CHANGES
Xcos info:    objectDeleted( 7 , PORT )
Xcos debug:   propertyUpdated( 6 , BLOCK , INPUTS ) : SUCCESS
Xcos trace:   propertyUpdated( 6 , BLOCK , OUTPUTS ) : NO_CHANGES
Xcos trace:   propertyUpdated( 6 , BLOCK , EVENT_INPUTS ) : NO_CHANGES
Xcos trace:   propertyUpdated( 6 , BLOCK , EVENT_OUTPUTS ) : NO_CHANGES
Xcos info:    objectDeleted( 8 , PORT )
Xcos trace:   propertyUpdated( 6 , BLOCK , INPUTS ) : NO_CHANGES
Xcos debug:   propertyUpdated( 6 , BLOCK , OUTPUTS ) : SUCCESS
Xcos trace:   propertyUpdated( 6 , BLOCK , EVENT_INPUTS ) : NO_CHANGES
Xcos trace:   propertyUpdated( 6 , BLOCK , EVENT_OUTPUTS ) : NO_CHANGES
Xcos info:    objectDeleted( 9 , PORT )
Xcos info:    objectDeleted( 6 , BLOCK )
Xcos debug:   propertyUpdated( 14 , BLOCK , INPUTS ) : SUCCESS
Xcos trace:   propertyUpdated( 14 , BLOCK , OUTPUTS ) : NO_CHANGES
Xcos trace:   propertyUpdated( 14 , BLOCK , EVENT_INPUTS ) : NO_CHANGES
Xcos trace:   propertyUpdated( 14 , BLOCK , EVENT_OUTPUTS ) : NO_CHANGES
Xcos debug:   propertyUpdated( 19 , LINK , DESTINATION_PORT ) : SUCCESS
Xcos info:    objectDeleted( 15 , PORT )
Xcos debug:   propertyUpdated( 14 , BLOCK , INPUTS ) : SUCCESS
Xcos trace:   propertyUpdated( 14 , BLOCK , OUTPUTS ) : NO_CHANGES
Xcos trace:   propertyUpdated( 14 , BLOCK , EVENT_INPUTS ) : NO_CHANGES
Xcos trace:   propertyUpdated( 14 , BLOCK , EVENT_OUTPUTS ) : NO_CHANGES
Xcos info:    objectDeleted( 16 , PORT )
Xcos trace:   propertyUpdated( 14 , BLOCK , INPUTS ) : NO_CHANGES
Xcos debug:   propertyUpdated( 14 , BLOCK , OUTPUTS ) : SUCCESS
Xcos trace:   propertyUpdated( 14 , BLOCK , EVENT_INPUTS ) : NO_CHANGES
Xcos trace:   propertyUpdated( 14 , BLOCK , EVENT_OUTPUTS ) : NO_CHANGES
Xcos debug:   propertyUpdated( 19 , LINK , SOURCE_PORT ) : SUCCESS
Xcos info:    objectDeleted( 17 , PORT )
Xcos info:    objectDeleted( 14 , BLOCK )
Xcos info:    objectDeleted( 19 , LINK )
Xcos info:    objectDeleted( 1 , DIAGRAM )
Xcos debug:   propertyUpdated( 30 , BLOCK , PARENT_DIAGRAM ) : SUCCESS
Xcos debug:   propertyUpdated( 25 , BLOCK , PARENT_DIAGRAM ) : SUCCESS
Xcos debug:   propertyUpdated( 29 , LINK , PARENT_DIAGRAM ) : SUCCESS
Xcos debug:   propertyUpdated( 30 , BLOCK , INPUTS ) : SUCCESS
Xcos trace:   propertyUpdated( 30 , BLOCK , OUTPUTS ) : NO_CHANGES
Xcos trace:   propertyUpdated( 30 , BLOCK , EVENT_INPUTS ) : NO_CHANGES
Xcos trace:   propertyUpdated( 30 , BLOCK , EVENT_OUTPUTS ) : NO_CHANGES
Xcos info:    objectDeleted( 31 , PORT )
Xcos debug:   propertyUpdated( 30 , BLOCK , INPUTS ) : SUCCESS
Xcos trace:   propertyUpdated( 30 , BLOCK , OUTPUTS ) : NO_CHANGES
Xcos trace:   propertyUpdated( 30 , BLOCK , EVENT_INPUTS ) : NO_CHANGES
Xcos trace:   propertyUpdated( 30 , BLOCK , EVENT_OUTPUTS ) : NO_CHANGES
Xcos info:    objectDeleted( 32 , PORT )
Xcos trace:   propertyUpdated( 30 , BLOCK , INPUTS ) : NO_CHANGES
Xcos debug:   propertyUpdated( 30 , BLOCK , OUTPUTS ) : SUCCESS
Xcos trace:   propertyUpdated( 30 , BLOCK , EVENT_INPUTS ) : NO_CHANGES
Xcos trace:   propertyUpdated( 30 , BLOCK , EVENT_OUTPUTS ) : NO_CHANGES
Xcos info:    objectDeleted( 33 , PORT )
Xcos info:    objectDeleted( 30 , BLOCK )
Xcos debug:   propertyUpdated( 25 , BLOCK , INPUTS ) : SUCCESS
Xcos trace:   propertyUpdated( 25 , BLOCK , OUTPUTS ) : NO_CHANGES
Xcos trace:   propertyUpdated( 25 , BLOCK , EVENT_INPUTS ) : NO_CHANGES
Xcos trace:   propertyUpdated( 25 , BLOCK , EVENT_OUTPUTS ) : NO_CHANGES
Xcos debug:   propertyUpdated( 29 , LINK , DESTINATION_PORT ) : SUCCESS
Xcos info:    objectDeleted( 26 , PORT )
Xcos debug:   propertyUpdated( 25 , BLOCK , INPUTS ) : SUCCESS
Xcos trace:   propertyUpdated( 25 , BLOCK , OUTPUTS ) : NO_CHANGES
Xcos trace:   propertyUpdated( 25 , BLOCK , EVENT_INPUTS ) : NO_CHANGES
Xcos trace:   propertyUpdated( 25 , BLOCK , EVENT_OUTPUTS ) : NO_CHANGES
Xcos info:    objectDeleted( 27 , PORT )
Xcos trace:   propertyUpdated( 25 , BLOCK , INPUTS ) : NO_CHANGES
Xcos debug:   propertyUpdated( 25 , BLOCK , OUTPUTS ) : SUCCESS
Xcos trace:   propertyUpdated( 25 , BLOCK , EVENT_INPUTS ) : NO_CHANGES
Xcos trace:   propertyUpdated( 25 , BLOCK , EVENT_OUTPUTS ) : NO_CHANGES
Xcos debug:   propertyUpdated( 29 , LINK , SOURCE_PORT ) : SUCCESS
Xcos info:    objectDeleted( 28 , PORT )
Xcos info:    objectDeleted( 25 , BLOCK )
Xcos info:    objectDeleted( 29 , LINK )
Xcos info:    objectDeleted( 20 , DIAGRAM )
