// =============================================================================
// Scilab ( https://www.scilab.org/ ) - This file is part of Scilab
// Copyright (C) 2009 - DIGITEO - Pierre MARECHAL <pierre.marechal@scilab.org>
//
//  This file is distributed under the same license as the Scilab package.
// =============================================================================
// <-- ENGLISH IMPOSED -->
// <-- CLI SHELL MODE -->
load("SCI/modules/atoms/macros/atoms_internals/lib");
exec("SCI/modules/atoms/tests/unit_tests/atomsTestUtils.sce");
// If previous test did not end properly, restore, else backup config file
atomsRestoreConfig(%T);
atomsSaveConfig();
// Do not use the autoload system
atomsSetConfig("autoloadAddAfterInstall","False");
atomsSetConfig("Verbose" ,"False");
//force official ATOMS repository
// Load the 1st scenario : See scene12.test.atoms.scilab.org.txt
// =============================================================================
atomsLoadTestScene("scene12");
Scanning repository file://TMPDIR/scene12 ... Done
// Install toolbox N°2
atomsInstall(["toolbox_2V6","2.1"],"user");
// Check installation
if ~ atomsIsInstalled(["toolbox_1V6","1.0","user"]) then bugmes();quit;end
if ~ atomsIsInstalled(["toolbox_2V6","2.1","user"]) then bugmes();quit;end
atomsLoad(["toolbox_2V6","2.1","user"]);
Start Toolbox 1
	Load macros
	Load gateways
	Load help
Start Toolbox 2
	Load macros
	Load help
if ~ atomsIsLoaded("toolbox_2V6")                  then bugmes();quit;end
if ~ atomsIsLoaded(["toolbox_2V6","2.1"])          then bugmes();quit;end
if ~ atomsIsLoaded(["toolbox_2V6","2.1","user"])   then bugmes();quit;end
if ~ atomsIsLoaded("toolbox_1V6")                  then bugmes();quit;end
if ~ atomsIsLoaded(["toolbox_1V6","1.0"])          then bugmes();quit;end
if ~ atomsIsLoaded(["toolbox_1V6","1.0","user"])   then bugmes();quit;end
if atomsIsLoaded(["toolbox_1V6","1.0","allusers"]) then bugmes();quit;end
if atomsIsLoaded(["toolbox_2V6","2.1","allusers"]) then bugmes();quit;end
A = [ "toolbox_1V6" "1.0" "user"     ; ..
"toolbox_2V6" "2.1" "user"     ; ..
"toolbox_2V6" ""    "user"     ; ..
"toolbox_2V6" "2.1" ""         ; ..
"toolbox_2V6" ""    ""         ; ..
"toolbox_2V6" "2.1" "allusers" ];
if or(atomsIsLoaded(A) <> [%T ; %T ; %T ; %T ; %T ; %F]) then bugmes();quit;end
// Remove toolbox_2
// =============================================================================
atomsRemove("toolbox_2V6","user");
	the package toolbox_2V6 (2.1-1) is currently loaded, It will be removed at next Scilab start
	the package toolbox_1V6 (1.0-1) is currently loaded, It will be removed at next Scilab start
// Restore original values
// =============================================================================
atomsRestoreConfig(%T);
