45.88293878229611,4.915993567107522,1429262651008166
45.69384474387859,4.798274814028408,1429262661004440
45.84600578053997,4.949816922611283,1429262670992013
45.7209833842002,4.84895775016837,1429262681021209
45.78208267849614,4.922126673372296,1429262691001785
45.82014235279427,4.827990161693965,1429262701028526
45.794229359916365,4.888602375053604,1429262711009639
45.747613448988595,4.854591756693487,1429262720992702
45.8090980134915,4.904862775850049,1429262731048875
45.76108310221908,4.9183325172546235,1429262740994421
45.73714955821886,4.939205748974954,1429262750986973
45.7871394083822,4.929392565180841,1429262761004373
45.740293174246936,4.8867239972822345,1429262770981803
45.697497169459766,4.924172567584282,1429262781042487
45.74634338969861,4.879709018111123,1429262791022450
45.844910168649946,4.9074926886686265,1429262801002822
45.853637862668826,4.822577842298302,1429262811026682
45.83547717324374,4.810240761080709,1429262821006796
45.71405323499662,4.818216049524608,1429262831005731
45.77514320572218,4.835032107075359,1429262857960227
45.72890270697948,4.904344309269576,1429262868009464
45.80226747290959,4.863524399819112,1429262878060298
45.82769258559326,4.910837425862954,1429262888021978
45.71093380940717,4.8993718778891076,1429262897997020
45.74838660715494,4.8925221491973545,1429262907964195
45.73118708551058,4.916875433931135,1429262917985123
45.820874654761916,4.911992076326686,1429262928018323
45.84161882832655,4.924053002350718,1429262937966054
45.80942575576252,4.837878260135219,1429262948008864
45.744147874022616,4.925296402261616,1429262957994424
45.7175497914789,4.919239321331188,1429262968041656
45.69558921839399,4.882736602431005,1429262977991874
45.82698117913242,4.882564172550747,1429262987993260
45.73636991779229,4.881166847238865,1429262997997776
45.782358699041396,4.889002898868929,1429263007967673
45.803904424360105,4.872669011496147,1429263017980414
45.80730612366009,4.95821918488592,1429263027987387
45.72884374768706,4.907298333067249,1429263037958894
45.838893684883054,4.897332265212131,1429263048019789
45.7111624210852,4.903492033875358,1429263058022588
45.82773354768112,4.856510196494262,1429263067989725
45.78476797184363,4.90647732675633,1429263078008508
45.78797214096794,4.8748860356695305,1429263087960150
45.78263971839876,4.878574812217532,1429263097997292
45.78421707400006,4.839287622345779,1429263285973060
45.828002725878044,4.893214355126462,1429263296050234
45.78695926077014,4.902997403729818,1429263339989498
45.70534980185786,4.944031294756852,1429263349986767
45.74353176279968,4.941037451930843,1429263359968232
45.72279876646405,4.8885830358340145,1429263369980178
45.786989680859456,4.922913511203195,1429263391986718
45.87225339012882,4.8626571769393205,1429263401982224
45.75598305412962,4.803169580286133,1429263412008985
45.82274151071441,4.8742666314116265,1429263422002770
45.758757627955866,4.8765191464999535,1429263508017447
45.79275607831316,4.905637940851564,1429263517997495
45.704984557639634,4.860803669424492,1429263528018632
45.76902282580047,4.87631582582986,1429263538021040
45.76483930221867,4.8334894235096115,1429263547996952
45.791433783050024,4.895962032190586,1429263558009602
45.756882758956515,4.859818163061231,1429263656985445
45.807419895348865,4.896555796516199,1429263666979834
45.79684037915776,4.885338703584016,1429263677023408
45.80048891240472,4.902023807978127,1429263686989549
45.75172871848263,4.851222171478871,1429263852002342
45.83205927608991,4.830291696614684,1429263862010670
45.73925272235075,4.821830655766621,1429263871961679
45.80256398901322,4.880806860896704,1429263882033444
45.782506974651746,4.946771223796524,1429263892035261
45.752447388109935,4.932770449037471,1429263920968178
45.69216912116012,4.857445573689438,1429263930994656
45.789184568427686,4.870071027072695,1429263940967757
45.72984655440818,4.839924848309891,1429263951021477
45.86412760811198,4.851499059644818,1429263961034464
45.75439474020199,4.891585397954019,1429264210978685
45.76066886966131,4.853037018465479,1429264221001179
45.809439063413265,4.829958765443147,1429264231023662
45.73402428645084,4.866332803844968,1429264240967776
45.78743683701348,4.839380798773313,1429264251007988
45.78575436359582,4.908820787844719,1429264261041637
45.82813129043593,4.858454850902412,1429264271090406
45.783958108070195,4.9302518163054305,1429264280990782
45.805543877485384,4.889288011661278,1429264290985873
45.85954131224439,4.883811345610119,1429264301043390
45.76736576155381,4.971260881998803,1429264311000970
45.81833550733851,4.938910245554417,1429264320990089
45.84586391024001,4.910721105226822,1429264330977047
45.76732239060066,4.86483000587153,1429264340973272
45.84651253345168,4.868278016253808,1429264351037731
45.790700800280035,4.890300328076915,1429264360927773
45.73533323158108,4.931615776553555,1429264371013093
45.87189809852265,4.846590861333963,1429264381050169
45.748798304657385,4.882548289451831,1429264390969799
45.73670496745782,4.943750648529491,1429264400997646
45.75279532426949,4.80319303693645,1429264411033312
45.768061236272395,4.841129227350052,1429264421031330
45.75631555871479,4.838590195495055,1429264431025596
45.803131599702766,4.951530686314866,1429264441058136
46.0194574389676,4.734357703398451,1429344552986433
45.979286614574434,4.746696193855692,1429344563010695
45.99526723167247,4.681615808744986,1429344572997251
45.97362376098242,4.812920774124635,1429344583029092
45.99634286021749,4.774251273496469,1429344592993582
45.9886318230153,4.706203165088714,1429344603003692
45.8710704444522,4.750681980499676,1429344612993159
45.98577078393955,4.807697513923383,1429344623041091
45.96696530162568,4.796120173828271,1429344633053814
45.922114450784434,4.647741126614115,1429344643020251
45.903553494195116,4.744756438634851,1429344653035774
46.03034216228876,4.768337836514872,1429344663001250
45.92749558333385,4.7550578061258895,1429344672999735
46.080744256159626,4.817372180187225,1429344682935935
45.96781551244308,4.766328677516049,1429344692946684
46.06418442354843,4.704721068210947,1429344702983105
45.89930356325812,4.713936761944449,1429344712962958
45.92751955215542,4.746966749801203,1429344722977973
46.00064972626379,4.750007805853321,1429344732965112
45.97377075955797,4.808231273848799,1429344742959543
45.93216396262017,4.734663374144338,1429344753039094
46.005921836234016,4.78179590682211,1429344763040019
45.947728311796375,4.716798240686867,1429344772965930
46.01914906065834,4.75054386310323,1429344783035178
46.033890637869504,4.731775795126012,1429344792969875
45.9720402414187,4.698751225840672,1429344802987816
45.92606389170862,4.734786883866235,1429344813051206
46.08832372902632,4.760784414749062,1429344823008516
46.01585796742898,4.733715544541883,1429344832989097
45.995141846971755,4.76916668047412,1429344843031120
45.99989157044101,4.844347527820367,1429344853991727
45.97466464202393,4.774988623375682,1429344864018577
45.98870390710214,4.76197106969596,1429344874050475
45.93625507351146,4.731665326951443,1429344884003536
45.90256815409719,4.757424771497261,1429344894018286
45.928683538223524,4.7363404969118,1429344903968311
45.94778662476784,4.725920275876115,1429344914068843
46.02752259842622,4.801155299574975,1429344924026466
46.07885493945715,4.695211289389176,1429344933971509
46.029370214723315,4.81411640769271,1429344945033808
46.01436743330587,4.846488562124259,1429344954980166
46.005007105574585,4.778597631857745,1429344964986481
46.07866966149503,4.718985636811069,1429344975020710
45.9052425897352,4.738568296809565,1429344984999639
46.01943622502446,4.7484157746093665,1429344995011052
46.13888363050816,4.7632387377504735,1429345004990256
46.0226847181576,4.7865307029576005,1429345015026302
45.98605655685245,4.806159526896146,1429345025027711
46.05596584701828,4.688832560021123,1429345034987716
46.04749201354526,4.741133318050286,1429345045020233
45.988167279129485,4.701089033191035,1429345055052528
46.00533361478231,4.785473556281428,1429345064972849
45.96906428704217,4.832584426495924,1429345075009091
45.977947727103576,4.761516523676425,1429345084996584
46.04445843125785,4.7493231484579415,1429345095018837
46.007741450262344,4.7728102966121035,1429345105003353
46.0734570670688,4.73026514421949,1429345115011464
45.923381495768794,4.672613622438326,1429345125019904
45.91392291883968,4.752227133730203,1429345135014720
46.0159722461155,4.693141419684094,1429345145004584
45.99808922716058,4.741357526205473,1429345154982975
45.967522151136485,4.7360899622873465,1429345165004395
45.990946010937826,4.686653569541794,1429345175002151
46.044641185170576,4.778845192466168,1429345184964829
46.024911768946545,4.776413535917425,1429345195043604
46.021764874004155,4.747028064897842,1429345204986875
45.915414991577954,4.807210443083748,1429345214968061
45.93557178880493,4.786260504055972,1429345225025577
46.07457680821339,4.773746847585728,1429345234992916
45.95263603273445,4.791085348184975,1429345244988963
46.03486909488149,4.755264778507943,1429345255009064
45.93463714007881,4.739325215667229,1429345265037877
45.99211794444386,4.747233556990826,1429345274982566
46.007896979212646,4.703796723117307,1429345285023193
46.05252739304901,4.68622917246525,1429345295009822
45.99177246978417,4.78600609569121,1429345305020240
46.022077360849416,4.80908696109523,1429345314996704
45.99318568323501,4.734673648805409,1429345324985838
45.98299935255982,4.862038191218493,1429345335030952
46.040313907647004,4.733545962660992,1429345344995059
46.06871707288323,4.782723141500655,1429345354937823
46.048857012378896,4.768382471741902,1429345364962535
45.90125203109481,4.750719386443074,1429345374987777
45.90299437875576,4.743644710653243,1429345384973285
45.99046502236241,4.840613682238572,1429345394977065
46.01556781403228,4.758646561385905,1429345404929372
45.99194418166544,4.800085019049537,1429345414935828
46.044688100062764,4.76756128435825,1429345425002810
45.94483883898698,4.687010263109536,1429345435011213
45.99162534852884,4.814821318402414,1429345444984561
45.93188332532191,4.795854271069385,1429372449984011
45.91996519403278,4.78794961567259,1429372460024252
45.879569666994186,4.809168342758053,1429372470010676
45.94500829891814,4.822829720918532,1429372480015479
45.937136873850854,4.820256850633385,1429372489981582
45.980627154607234,4.809199295136533,1429372500021536
45.9627955250775,4.792481743804106,1429372509998367
45.9638659501975,4.671280106077303,1429372520016185
45.876469328896896,4.7857284992432705,1429372529937930
45.89929331225076,4.7886190148692895,1429372539985010
45.94006999869811,4.809120264092658,1429372550026171
46.02950477349647,4.739964359720592,1429372559993216
45.88008872781515,4.794888977634383,1429372570003929
45.93058768186345,4.757523135838555,1429372580025992
45.84768422274675,4.82909077612158,1429372590009919
45.96325813879904,4.765421900501606,1429372600013736
45.982664866603216,4.786262824532526,1429372610030449
45.92025461932181,4.797326085559405,1429372620016036
45.997354385409714,4.777444343413298,1429372629928527
45.93147296346921,4.773289096774898,1429372639967906
46.01841721453151,4.819659554361533,1429372649999256
45.86426998528527,4.834691048574307,1429372659973592
45.91844490524923,4.771120111166236,1429372669995002
45.988252655576325,4.789504059537542,1429372679985929
45.93692117105034,4.806589202352424,1429372689938252
45.92646192165527,4.827092525556833,1429372699996965
45.9618691434332,4.810632220775164,1429372709959629
45.9355933325267,4.800027461734095,1429372719973711
45.86663798612033,4.770286536809528,1429372730033159
45.86527629054903,4.8398378406006595,1429372740033175
45.8903311970868,4.782409160994273,1429372749955568
45.94390935470796,4.779903630384345,1429372760023529
45.972184285896546,4.777650114576213,1429372769985705
45.938100331391645,4.751601053410354,1429372779989112
45.9030944029516,4.756953025385733,1429372789963176
45.924730474258304,4.824630953668424,1429372800021439
45.95500645185787,4.793852751650709,1429372809970983
45.916767460358635,4.907689769295476,1429372820006272
45.946579885215705,4.8524034645875735,1429372829966983
45.87351479165338,4.768275013943848,1429372840007612
45.990130750997984,4.776187525173023,1429372849966255
45.927320896718854,4.8145283463138,1429372860021427
45.9575883410958,4.848537100835208,1429372869988749
46.00951776128014,4.701605793179147,1429372880006983
45.918245394681186,4.847276976672233,1429372889996368
45.980191477377545,4.805155298982832,1429372900002864
45.973474445563525,4.8515702781416765,1429372910027462
45.8744437935978,4.825765522470803,1429372919979546
45.877092477460835,4.881998338646919,1429372929975844
45.90008733596813,4.866257496496372,1429372939985731
45.9637647776724,4.7907741848784715,1429372949998207
45.89979439875402,4.882115417680855,1429372959985074
46.008104665782675,4.761767702769847,1429372970015670
45.84273772330521,4.847457963945787,1429372979997984
45.92127496568195,4.832513188760327,1429372990007685
45.993200616801545,4.84576945034032,1429372999966652
45.947896270525995,4.734376481092405,1429373010062885
45.91731498207368,4.778204112772784,1429373020008743
45.95092813958531,4.782598563742265,1429373030019983
45.87501606029003,4.75542979976609,1429373040018306
45.931188441729546,4.784446351976454,1429373049958520
45.92933901640202,4.738075704440802,1429373060004982
45.907479291243625,4.8147947127495705,1429373069998328
45.93577463155345,4.822815273846664,1429373079994401
46.075819105968435,4.773673269669751,1429373089992222
45.89147371694576,4.855702282392477,1429373100023627
45.90205389158692,4.887238890548645,1429373109979435
45.91698270677766,4.913705823318253,1429373120044573
45.973978384144495,4.821320301716704,1429373129982864
45.995997266131376,4.848698297684105,1429373139998746
45.91586893912585,4.699958128954284,1429373150056317
45.891373002696,4.7594239550796775,1429373159957928
45.8840868668494,4.773321549264955,1429373170021923
45.9128713029513,4.852040678375553,1429373179998876
45.98359467978411,4.769664320191274,1429373189923958
45.95014382837907,4.815059715356164,1429373200016432
45.97425566858731,4.752089271842626,1429373210001915
46.00295113019973,4.843761913081101,1429373220021154
45.92105628679353,4.802110066773182,1429373230067949
45.879655446227964,4.811707162047528,1429373240061589
45.98839348089504,4.806258682185382,1429373250022842
45.94650215748715,4.810141624627139,1429373259976006
45.83192973366626,4.743755733218137,1429373269986576
45.92510858985577,4.766819465248506,1429373280009193
45.95514314091527,4.720101871366845,1429373289976227
45.94623816420564,4.857947640475179,1429373299976099
45.92899999937008,4.836770202628896,1429373310026881
45.96103135068113,4.781398324894002,1429373319973069
46.0370547954917,4.8029445352549365,1429373329983998
45.94585374810226,4.816815819195521,1429373340007528
46.06667129435153,4.748929730534491,1429373350980105
45.969974840481136,4.780023444981373,1429373360995893
45.95334412543282,4.791212677625113,1429373370966536
45.8850024381176,4.895599766246704,1429382349972653
45.94158683757143,4.859480177927693,1429382360004625
45.87315458696028,4.810026574883777,1429382370003007
45.965379140664716,4.852286917188262,1429382379963725
45.94833638512139,4.837703708155654,1429382390044139
45.907106530324995,4.807625539500486,1429382399933749
45.93815071723117,4.896187893702692,1429382410000355
45.888030697859726,4.815237139991223,1429382419986087
45.919993168880225,4.764396366996105,1429382429984256
45.92570386790529,4.827184982611208,1429382439996231
45.90228594594584,4.803736617999487,1429382450018519
45.932485873427936,4.835728066649659,1429382460018348
45.92118216951375,4.776066438849514,1429382469982087
45.98060501035421,4.735642418845603,1429382480025254
45.92377535834196,4.797160541190656,1429382490025073
45.89980519533014,4.8465581784892295,1429382499970628
45.948904920678686,4.733702830372643,1429382509951700
45.86192285674812,4.780046387100713,1429382520026471
45.95303257990177,4.846479384877701,1429382529990204
46.00810925321058,4.785960437827626,1429382539991649
45.929083538337714,4.797064233309939,1429382549968082
45.98107298022712,4.791057195630541,1429382559972705
45.88879221769424,4.852546453004453,1429382569997276
45.87479178322925,4.817369123279086,1429382579978274
45.914912107999136,4.814506587794217,1429382589995719
45.964997790552644,4.795156414978333,1429382599992351
45.92290296203934,4.819525820329254,1429382609988880
45.91435608101444,4.76858663467212,1429382620007356
45.98593917074578,4.8173206418953995,1429382630027106
45.88376236978627,4.785967248928388,1429382640030736
45.91405278035258,4.831035971163229,1429382650028214
45.91755803968991,4.875124557439796,1429382660028032
46.011322174572584,4.817820961873143,1429382669976069
45.9039966730007,4.837948527072634,1429382679993286
45.99812459835741,4.772798398614133,1429382689984143
45.97935791076494,4.8505739436373885,1429382699943552
45.819228008685144,4.78191799951495,1429382709983552
45.89503424343613,4.775722559993417,1429382720025280
45.939871864185115,4.74998573844823,1429382730007745
45.93325535269418,4.81982985849161,1429382740011545
45.93140922997665,4.803301579712099,1429382749982623
46.01305743540823,4.797692552397289,1429382759927671
46.060914968005925,4.886038512058472,1429382769959072
45.90090847973082,4.826550384736505,1429382780047726
45.96592370485192,4.765496991019377,1429382789948288
45.87468849331618,4.75246392523725,1429382799987684
45.99525262037213,4.732941275347411,1429382809951008
45.99707756815931,4.769655604545171,1429382820026280
45.982668132977665,4.790546582871971,1429382830021336
45.93219503696902,4.8210347409098055,1429382839992670
45.910954144083874,4.756880879425266,1429382849994318
45.82952477368468,4.734363209501199,1429382860006620
45.88700361481741,4.846975252595697,1429382870012341
45.89840941792566,4.849667391942561,1429382880000839
45.92961945998002,4.810270024722069,1429382889966429
45.93825664696377,4.901406714302078,1429382899948428
45.90447402510056,4.809766089624727,1429382909990416
45.84035159273561,4.837595845791672,1429382920020322
45.94893201425439,4.755210838336462,1429382930003764
45.906125320668366,4.839279141567057,1429382939979701
45.96025813592694,4.862759176853015,1429382950065650
45.97961009559192,4.786710979968059,1429382959995010
45.96227183337637,4.837936003776722,1429382969987386
45.98839020431381,4.762512284230932,1429382979987175
45.98000719620557,4.774834606596205,1429382990039537
45.871825209532,4.820868144325405,1429382999988843
45.93988870703066,4.813015810560522,1429383009970208
45.97491523054969,4.842483103850432,1429383019961702
45.83572475345073,4.808253887600123,1429383029986289
45.94168992275037,4.839478163086665,1429383039985734
45.98118782068061,4.82157457874154,1429383050046268
45.907819003684274,4.819636388995835,1429383059975449
45.88878255111433,4.863620827713118,1429383070008649
45.9135086359539,4.782153640396768,1429383080006521
46.03494321495971,4.808536864654083,1429383090003944
45.96495099058939,4.864688099747512,1429383099987841
45.93642956634935,4.79921779195507,1429383109916467
45.916811702368726,4.760047854290375,1429383120013037
45.847243534508905,4.7928360485849755,1429383130010387
45.90217874403434,4.782764902353479,1429383139976064
45.898162802347976,4.7553111623915525,1429383149993063
45.95985330458232,4.807706281982143,1429383160005813
45.94635985985513,4.8046878965958,1429383170014851
45.987026807199534,4.8391269394524965,1429383179974017
45.98343522521408,4.831771512772477,1429383190040797
45.86741373796129,4.736721408821694,1429383200036433
45.99435391787119,4.770667218375288,1429383209959203
45.93596817767819,4.797558584093962,1429383219971883
45.9504759216409,4.82989600358108,1429383229982136
45.941656272115694,4.730991866776986,1429383239994618
45.89673934945096,4.831615060698536,1429383250016864
45.9409815509789,4.858756301736243,1429383259994327
45.91688568687079,4.843622212473597,1429383270050311
45.938560300131606,4.81625258734005,1429383279984713
45.953304204832804,4.78772262262639,1429383290009437
45.96677375261545,4.880173648144188,1429383299995932
46.022695590182366,4.809765737153789,1429383310002035
45.97200855899283,4.778180500197033,1429456150028844
45.98239686000523,4.8534568330641275,1429456159939686
46.013521267749056,4.730798167204737,1429456169965501
45.96092723885832,4.796148870538719,1429456179946461
45.98576542845836,4.739493338530865,1429456189958604
46.00797530658079,4.759906733599854,1429456200011824
46.032160182939464,4.742716448345842,1429456210019993
45.9664174052816,4.721434557512011,1429456220018523
45.96005506110613,4.779923580119633,1429456230011430
45.99784604152906,4.739012602870593,1429456239987056
45.999601680753585,4.713942010833499,1429456250029795
45.98488271147128,4.80881111517591,1429456260048136
45.920584362911136,4.726298869550186,1429456270039973
45.95121485593478,4.734009379910562,1429456279983458
46.04193487317136,4.703135894107956,1429456290018630
45.95462552620072,4.690452137397195,1429456299970026
45.98975324587332,4.7245238258242575,1429456310013760
46.06309160839982,4.752004005809377,1429456319948067
46.06897170311227,4.815233569813858,1429456329974266
46.073555940475465,4.8321616629814015,1429456340013862
45.95774019588579,4.7162128655561215,1429456349963147
46.014891852067436,4.723951101358857,1429456359952919
46.016492087662336,4.824169815492066,1429456369993869
46.03120923358201,4.796865025475496,1429456379939332
46.04863243775385,4.690178705487538,1429456389978654
46.050483542728884,4.826814417058592,1429456399967876
46.02936880778869,4.766741603886833,1429456409994981
45.9941565666855,4.818771434346319,1429456420031562
46.02100405791031,4.787965375120872,1429456430005628
45.97998658102729,4.826859135799613,1429456440016077
46.0605962756847,4.703890542717507,1429456449997420
46.027492457085586,4.811709079478399,1429456459960794
45.94658809078793,4.729575636585892,1429456469990035
46.05240357110671,4.728776651020605,1429456479992941
46.00142357143608,4.740799617076014,1429456489951784
45.95139182374016,4.7187098702977845,1429456499957746
46.0433257786685,4.779343026165637,1429456510049337
45.96063300985032,4.756697361564007,1429456520020512
45.96083158747386,4.7668822293499264,1429456530019086
46.00103524613477,4.757745732615554,1429456539987997
46.06141134902111,4.72751349267109,1429456550000496
45.89580825448145,4.811324316345436,1429456559985603
45.987051921405424,4.818580573515367,1429456570014641
45.94801632741509,4.815070262975893,1429456580005433
46.014315080527254,4.781985112411162,1429456590031584
45.97779036961817,4.7209483431369295,1429456600041718
45.949367629409444,4.717824979907192,1429456609957959
46.00859761315829,4.709622920511539,1429456620023653
46.04170018661763,4.739171958517434,1429456630042412
45.958788744897745,4.793600162038788,1429456639986684
46.00226912894334,4.7420069442105355,1429456649954975
45.98873460634635,4.742214579059762,1429456660000615
45.980796467201166,4.722627755894456,1429456670009810
46.00346983584949,4.7528343955829735,1429456680025659
45.98220163278932,4.78241618502001,1429456689968896
46.06067924522672,4.745361771673934,1429456700015514
46.03382973435001,4.681932053251271,1429456709991344
46.049210835314824,4.738330606123899,1429456720011773
46.067227361167426,4.830599017408576,1429456730023345
45.931571456116245,4.754511282902413,1429456740031253
46.04185329059699,4.823205798201992,1429456750027959
45.94610145158367,4.803340795240954,1429456760009096
46.09495383939515,4.790619508726783,1429456770026788
45.91193184909033,4.691653995987908,1429456780008553
45.97189337748887,4.79183280103981,1429456790016282
45.976491424986804,4.681211794347966,1429456799950101
45.97886732344374,4.825003745838208,1429456809982355
45.88951306199309,4.734436003266982,1429456820023602
45.960660478273695,4.7350971235201325,1429456829978833
46.061828497393456,4.767381720320244,1429456840036973
45.99271614033689,4.675416836570372,1429456850026701
46.00982476060823,4.769448183014059,1429456859983895
46.01049643231273,4.755644945405354,1429456870010063
45.99936720261126,4.729273989062815,1429456880029491
46.063776385602615,4.760841059859089,1429456889964102
46.03310531678941,4.761421012264031,1429456899995534
45.97765557695659,4.731739640147481,1429456909963147
46.06783701626971,4.709549759156569,1429456920029952
45.93191867775101,4.721771985008931,1429456930001383
45.97358221596896,4.790901741714119,1429456940042055
45.90392523878137,4.7681314674865165,1429456949994217
46.089338905009825,4.80030636618213,1429456959999259
45.874674725796034,4.710250778903394,1429456969952386
45.971036707751736,4.756372721988316,1429456980001805
46.05568261533771,4.760338629343939,1429456990015339
45.96865388305711,4.765520234333345,1429457000009408
45.999719942895624,4.762942026154302,1429457009986853
45.93534859113201,4.725564788368222,1429457019987668
45.9422311451712,4.651517515872553,1429457030000192
46.00714643675572,4.700226984583739,1429457039990626
45.984282073116354,4.786922991727426,1429457049996726
46.03516786881288,4.716318227285338,1429457060013253
45.93283397938268,4.813672885715516,1429457070047044
45.93474070594038,4.816155388050844,1429457079981771
45.999229862989154,4.7358222160250545,1429457089977251
46.000118374222794,4.771214796183815,1429457100034101
46.007655319629734,4.786321497733437,1429457109983730
45.93468563987476,4.799169115052684,1429457119980134
46.03768854942433,4.764500480269036,1429457130006507
46.050315727395976,4.770884895709038,1429457139992675
46.066321879482274,4.804157122695639,1429457150041209
45.976417198977806,4.827295377400241,1429457160047751
46.008769053433014,4.743569373307159,1429457170014697
46.08317756267299,4.646118950345113,1429457179962295
45.947606918863364,4.64708755857659,1429457189975163
45.94448892975093,4.802573520279778,1429457199969512
46.01798740820727,4.752063640280441,1429457209984362
46.01009065738768,4.7645143134735255,1429457219972225
46.015253023581444,4.813203113721773,1429457229982871
46.00324278721905,4.734246900648841,1429457239992948
46.048375205751555,4.778024060977826,1429457250021613
46.08378838325941,4.7696305144260185,1429457260019746
45.960994748886236,4.80620100803374,1429457270046437
45.95199794937797,4.741866441645786,1429457280001443
45.9917735341463,4.708946116790615,1429457290008397
46.00706085750031,4.72583652309422,1429457299998917
45.97869020379863,4.7171961137605445,1429457309991991
45.92224887620145,4.684553706862496,1429457319970904
46.01689908155205,4.828160859863308,1429457329945000
46.015014633125446,4.808359433575561,1429457339995787
46.08811473928857,4.806359408669114,1429457349991053
46.0151237770716,4.786003352929124,1429457360018135
46.07343257879076,4.761706150649007,1429498940999151
45.917114358902516,4.7417806737458035,1429499860981957
46.10859237751347,4.7041330718390375,1429500067960946
45.997163265441564,4.7109537102718475,1429500077985025
45.98903975340716,4.747553780253192,1429500088009119
46.014419929222335,4.697994055331143,1429500098002861
45.99546734902477,4.716523514054071,1429500107966617
46.008084996200544,4.712726143384818,1429500117982943
45.965956711171124,4.758021828568812,1429500127988285
45.97138181843352,4.745583312883682,1429500137987044
45.905134007902205,4.752650545538706,1429500148048974
45.98381476008196,4.820584354511309,1429500158042112
45.98893666598722,4.751628728187735,1429500168030756
46.037727387142034,4.788240734248816,1429500178044834
45.988788255770565,4.671287098526147,1429500188012973
45.999569370958184,4.775386252007547,1429500197958227
45.901664370738786,4.825340607962926,1429500207961620
45.97117406065405,4.775648339188018,1429500217990286
45.990715444811336,4.792389728513837,1429500228045864
46.00386352992203,4.7022435688447,1429500238036874
46.044648401031985,4.79811010176794,1429500247979593
45.81860360122398,4.840477050760873,1429549147938906
45.78870113152859,4.858443758467409,1429549157976864
45.80958731901839,4.903463362113961,1429549168091501
45.72937472508231,4.906853744154541,1429549178033096
45.67191508933341,4.858266298314566,1429549187997286
45.75097475820839,4.878075993504331,1429549198022992
45.76260077451905,4.867796575414834,1429549207967942
45.7878822446096,4.761865972992285,1429549218009887
45.6477274400967,4.91726883565742,1429549228026194
45.70238207828777,4.8680870207119735,1429549238011531
45.79892610768751,4.87475389680259,1429549247969568
45.74749261871706,4.819216960287348,1429549258032531
45.73397233621194,4.853241344346351,1429549268009740
45.732878078256256,4.895636882414859,1429549278017768
45.73845365736109,4.821654752128814,1429549288009086
45.75155743300138,4.893199794212045,1429549297965481
45.77866461909867,4.871649399863303,1429549308004611
45.71757399602579,4.8994857799948734,1429549318000603
45.74675975191965,4.814244075464753,1429549327995286
45.75903741099513,4.77590379793922,1429549337974923
45.711079719970485,4.892523239344397,1429549348041519
45.78580372116402,4.937857110448349,1429549358017659
45.78281003806559,4.922309799537765,1429549367987050
45.782027361821726,4.759418977978326,1429549378031247
45.74604674034007,4.82155375056729,1429549388064792
45.775973043507385,4.829501804520914,1429549397988261
45.74135060977487,4.762584846782238,1429549407939695
45.73642467939419,4.915112969854595,1429549418011948
45.81437702212203,4.763004430604926,1429549427988003
45.77596702870274,4.905723823201415,1429549438029734
45.81362172559022,4.79757383634694,1429549448032008
45.780896597534046,4.854969033117653,1429549458047064
45.68844474066901,4.894552522144804,1429549468004466
45.74506378305172,4.836695497326514,1429549477973151
45.777057721436314,4.872592422786175,1429549488022644
45.7696604974484,4.845345648377242,1429549498032567
45.7414216797912,4.9031780249905035,1429549508017508
45.78315687606321,4.863796186336421,1429549518017311
45.73886597730261,4.869194232703209,1429549528011995
45.870583690052925,4.827928875784494,1429549537996456
45.83022141637938,4.851777290232506,1429549547969965
45.8016305920363,4.847317294626912,1429549558025634
45.77649333932403,4.911288365379705,1429549568021420
45.794188855038655,4.8763228927299735,1429549578024129
45.75909218707857,4.932124880418038,1429549588001246
45.76024222222562,4.749148247155332,1429549597985864
45.734079219578916,4.876149354131881,1429549607991257
45.75230484511195,4.852422070707863,1429549617952146
45.77138572375409,4.8463549581069705,1429549628013859
45.80653351500137,4.885966100306791,1429549637984772
45.7793583396753,4.837295290178318,1429549647966011
45.794870300559126,4.888567224693468,1429549657988216
45.81090141538925,4.822533065250928,1429549667983259
45.7309268905823,4.862278842356951,1429549678020305
45.76352892858914,4.82945984628301,1429549687994282
45.68353425239875,4.863950677991857,1429549698004342
45.758880480679736,4.912994572176912,1429549708000091
45.69617768159726,4.840103856630327,1429549717949096
45.73849067104313,4.801753251969279,1429549728006023
45.68974111532399,4.865270194263198,1429549738958621
45.828382116411994,4.933774734010721,1429549749018723
45.78972289487865,4.798417023721725,1429619049969157
45.786331075041254,4.853769841027486,1429619059992800
45.74532782440111,4.978399134355192,1429619069950225
45.80737078423593,4.898647098137208,1429619079984163
45.84493060702877,4.956157147096051,1429619261960876
45.76398001820174,4.871646053770611,1429619271997187
45.77360577401294,4.890102686582095,1429619282032775
45.82825125006826,4.848749142050197,1429619291957475
45.82431733921968,4.8305736699374275,1429619302028422
45.78975411722342,4.9267294791742335,1429619312001803
45.82250374461494,4.857222335558702,1429619321995315
45.78315521176735,4.832240036226717,1429619332052040
45.72003229218707,4.8647511817997415,1429619341984067
45.71173659781803,4.941111187917762,1429619351991040
45.72594248678655,4.855884534662229,1429619362022869
45.860534615626605,4.869826736304359,1429619372016414
45.766396039601645,4.9416649979402765,1429619381986564
45.69680214456575,4.889204473437232,1429619391978530
45.824102771427086,4.843818738492029,1429619401989549
45.85530976352794,4.869187080275251,1429619411990167
45.84313626678215,4.8763367734337715,1429619422021122
45.786483581354034,4.891400517144981,1429619431979287
45.795917675355845,4.909852493562307,1429619441980809
45.77134976259081,4.894707027415551,1429619503955169
45.75444075619235,4.90755468877207,1429620051980311
45.811538753476206,4.862268524951521,1429620061949015
45.78559744092643,4.911385876114883,1429620072011636
45.72944946933067,4.903798935440305,1429620082025501
45.746651588498466,4.889118605983521,1429620091961507
45.75938590058936,4.944614523347221,1429620101992413
45.856048874204824,4.853696799435294,1429620112037454
45.7953051373735,4.949589541687076,1429620121967231
45.703740637341184,4.8999314300222565,1429620132059014
45.762871262951194,4.886055459805419,1429620142034119
45.671391946906496,4.897620727937462,1429620151994236
45.84823284944323,4.872063674795942,1429620161968301
45.83022804214721,4.895258282816913,1429620172009982
45.784678231742795,4.977518453196717,1429620181964007
45.811041428260054,4.816916233647381,1429620191985001
45.837569024142894,4.888342486699677,1429620201987955
45.79309985064964,4.930192162447188,1429620211960281
45.72854920159402,4.908505579005437,1429620221971913
45.85517017706225,4.846325534285346,1429620231987196
45.79195265826147,4.915929853235031,1429620241999752
45.78214828674892,4.7792100047078305,1429620252017878
45.796228056362935,4.8373964079817044,1429620261987613
45.8747807766205,4.894282100500229,1429620271995775
45.80215085247487,4.890699408542927,1429620281974163
45.7876524846789,4.9760128065618465,1429620291970286
45.7354102706525,4.870698798398645,1429620302050176
45.715961486932834,4.905971129332137,1429620312014474
45.790714100713664,4.981878793183291,1429620321981602
45.839081577074175,4.809234669858847,1429620331986925
45.72549995599653,4.848671269699042,1429620342031871
45.7116726590298,4.895848849623834,1429620352028534
45.80977937142439,4.871634072712836,1429620361988809
45.804393586364654,4.8590666147553625,1429620372001851
45.71090821695421,4.739408164019133,1429620381935451
45.76226030738172,4.87040688836814,1429620391982356
45.73993127146138,4.830051827890281,1429620401968422
45.763647661662795,4.873788006757156,1429620411972596
45.85007107951294,4.860503906822242,1429620422032433
45.83916356045939,4.8996595626276935,1429620432018846
45.74448459196472,4.935384725296692,1429620442002987
45.779218321312946,4.846117885324699,1429620451979277
45.73231576597284,5.013057962626505,1429620462041428
45.775584401230645,4.941238377036426,1429620471952187
45.7683211778459,4.962408549586485,1429620482013981
45.84172362425692,4.885005428203417,1429620492016512
45.73083242218831,4.930434766775717,1429620501984652
45.78309942935719,4.78669262912794,1429620512054779
45.79996557533712,4.8569647223433,1429620521966678
45.811601777230194,4.845386472447723,1429620531975633
45.689434496714206,4.908146340370469,1429620542009765
45.7595429600001,4.832684836690909,1429620551982662
45.751405323015646,4.820080537185594,1429620561976338
45.80551429254955,4.834041671790532,1429620571993100
45.81680166322673,4.944893369434689,1429620582017881
45.78641285379377,4.813431351297399,1429620592011701
45.782019151966466,4.9010043142091755,1429641561995344
45.83111762981789,4.8490969395632195,1429641640015561
45.84266596357072,4.872108353833563,1429641649998231
45.83775338883879,4.940657311654339,1429641659984413
45.798164233724776,4.858442628073225,1429641669966287
45.75296977304512,4.811599976648812,1429641679998370
45.923544195884375,4.788251400747552,1429873051937000
45.90665800101229,4.789447636184767,1429873062081412
46.030429198548205,4.774317004112166,1429873071990173
45.962903495923804,4.7506016736684815,1429873082028921
46.026829858669366,4.794976365400926,1429873091997429
46.04578495058972,4.7484922705072865,1429873101990352
46.109027059652846,4.798370770324865,1429873112001461
45.90836324485003,4.761120853955849,1429873122006879
46.04971764935825,4.693685806314614,1429873131979944
46.0391244741386,4.7982832577147905,1429873142010046
45.98780261800387,4.761581359085725,1429873151992776
45.98504473073568,4.783879099606218,1429873162033500
45.96514991652325,4.753303495803133,1429873172014755
45.9341730178909,4.753984930640402,1429873181992106
45.97958768553461,4.702746528641425,1429873191999637
46.06952883243182,4.716788332558655,1429873202027203
45.93503454867765,4.746495749051222,1429873211949818
45.98914701697967,4.734530607516231,1429873221991928
45.955213848890715,4.764551584221758,1429873231948813
46.09866737783678,4.782469906608229,1429873241985293
46.02657456779356,4.769495971909657,1429873252006668
45.95143453171399,4.706416508772258,1429873262000285
45.94834648756413,4.792924346860473,1429873271996253
46.014404398201414,4.7284158904347064,1429873282037324
45.945817849004406,4.795606125307914,1429873291975033
46.028144879402895,4.812596288105427,1429873302013591
46.03558605150041,4.8087031873320125,1429873312003592
45.993477043877675,4.7507050865901705,1429873321987845
45.959445586806495,4.698328992396016,1429873331951702
45.943979169840325,4.804392010293798,1429873342054595
45.97642850767389,4.752508690961439,1429873351960068
45.98904767966989,4.736574889403225,1429873361943322
45.95739393222923,4.735082755056324,1429873371983045
46.01315426881214,4.713886255212229,1429873381988137
45.9756523094983,4.720037857987893,1429873391972889
45.98410626772793,4.791208032338758,1429873402055632
45.86341850559866,4.778167552181638,1429873411985321
46.02272819642867,4.775889215744161,1429873422032365
45.983803443354134,4.676739568678245,1429873431966774
45.95103137840577,4.760290351538556,1429873442002620
45.939079548835494,4.787420203025736,1429873451977803
46.092124215248084,4.725236216101865,1429873462001515
46.04383751477511,4.805469075384346,1429873472006181
45.99480989547966,4.787081788395397,1429873481972725
46.036282202640166,4.726684933399292,1429873491945481
45.95272865061245,4.677264202820397,1429873502034011
46.06719129868999,4.766568329974301,1429873512000127
45.942537488030425,4.753497691515923,1429873521985068
46.00754504876463,4.748677973578065,1429873531996138
46.00781666110046,4.784666250521461,1429873541987986
45.97278307001853,4.775692607420105,1429873552028212
45.99957114387715,4.850532449355002,1429873562007158
46.05541331299407,4.7415540094648545,1429873572013273
45.964385472399,4.804599267651254,1429873581978940
45.920293257101235,4.783880394684912,1429873592010007
45.942786707625864,4.828113802203579,1429873601993472
46.1231647541975,4.69644175421715,1429873611984427
46.07715867607591,4.759528892271454,1429873621969630
46.09269808261438,4.791622636078815,1429873632010327
46.0103483972321,4.73093938950853,1429873641967597
46.0672803481488,4.762947348864139,1429873651985448
45.973497768263655,4.761240976879812,1429873662013067
45.959889747851726,4.708145823689896,1429873671988482
46.06398855048923,4.765699368141346,1429873681967500
46.01568891942335,4.788556582379351,1429873692004418
46.00830302926327,4.736440925220246,1429873702002309
46.01877685909471,4.767209307140147,1429873711994853
46.02930788526525,4.714835343326419,1429873722003545
45.948396150184706,4.754203241583525,1429873732010775
45.98060542228571,4.7860191449993295,1429873742036404
46.06099465206921,4.701348892825825,1429873751990048
46.03698096609973,4.734746841349277,1429873761976068
45.940395568915704,4.743130684866842,1429873772010864
45.975384989367974,4.823582175583891,1429873781969348
46.046889534844,4.807273346056516,1429873792009271
45.99504962395452,4.6472152178603805,1429873802037969
46.00815417282476,4.7432859384934485,1429873811983963
46.01239971562275,4.7697245308008425,1429873822004372
46.05294903907188,4.746028414208515,1429873832022124
45.961132703123965,4.755280115519774,1429873842014378
45.95636799874232,4.692481311405862,1429873851973355
46.015055377194415,4.835219273430875,1429873862008154
46.00882397505974,4.790655246152534,1429873872009989
45.95632441360648,4.82564754821332,1429873882004426
45.97942531452104,4.807966836619136,1429873891987541
46.0170183868202,4.785468637686917,1429873902016821
46.07394458293721,4.767221755286677,1429873912015154
46.085100691191805,4.837863380954232,1429873922028619
46.031008649416115,4.7714278019568175,1429873932001810
46.00791244357867,4.822398718212204,1429873941962208
46.01224474627163,4.775652663122412,1429873951925246
46.051135032406606,4.755694260277234,1429873962034395
45.97598659759307,4.785262507351579,1429873972005531
45.87806965338235,4.690211275469994,1429873982012126
45.972886406384,4.7259711217384215,1429873992011565
45.940015824383465,4.863229619023668,1429874001975104
45.99629789512948,4.698316709616863,1429874011997309
46.037149740018016,4.774700206633087,1429874021991282
46.00580317076234,4.7816504790415735,1429874032004389
46.0106847423442,4.808347880490445,1429874042010189
46.0802018550563,4.655536982363857,1429874051989674
46.00995589831922,4.715567619886029,1429874061959608
45.97060088360549,4.829023899909387,1429874072011166
45.99023904655656,4.76030009392024,1429874081988666
46.00278445375259,4.644033108278038,1429874091963296
45.96538917147376,4.701718341742181,1429874102054608
45.975090042935236,4.761601153976216,1429874112003162
45.95458835410918,4.775744662055602,1429874122038765
46.05721947396924,4.775601060065537,1429874131999774
45.94172122550166,4.757975754914326,1429874142001506
46.02142180055431,4.699990568613747,1429874151978673
46.06418029812324,4.704676020934451,1429874162036098
46.02059288410804,4.7246628430668665,1429874172009641
46.02311239790895,4.74800752901966,1429874181993399
45.989398851969156,4.799256494305188,1429874191966761
45.9472840445433,4.736865578782204,1429874202000947
46.01890098703923,4.78908856197598,1429874212020866
46.05419346521169,4.731736353233589,1429874222052420
45.98481343185577,4.881876905826886,1429874232012769
46.05481314424663,4.702993856507229,1429874242011041
45.929577875840934,4.76421081184453,1429874252005635
46.01852054381755,4.736700079389255,1429962774986612
45.958436303374896,4.749773008268738,1429962795051443
45.9862669311912,4.785128036670002,1429962805008672
46.003637735925906,4.710765944309491,1429962815026276
45.99265565239192,4.810928194392433,1429962825001527
46.02503330612179,4.7549889880414655,1429962834973078
45.98013893945088,4.704556737978857,1429962844995616
45.97134708770179,4.811781413628304,1429962854929232
45.93322423652916,4.720017802157724,1429962865035213
46.00121316032731,4.776715927395946,1429962874951261
45.960037390119524,4.805964010100589,1429962884987174
46.006901147633776,4.796619553708221,1429962895008670
45.901115018350126,4.764519088676262,1429962905019102
45.957657980287266,4.696777768803445,1429962914982196
45.89766562924244,4.811883520201954,1429962924999771
46.04770273420389,4.72783494565786,1429962934974403
46.0075666804188,4.742835641133993,1429962944961204
46.02341432118564,4.799202719655134,1429962954966900
45.9535608076715,4.747321337437351,1429962965017757
45.98770720771359,4.7163909685243,1429962975006500
45.9707938734892,4.730969907408067,1429962985019531
46.01503239299052,4.770577071399646,1429962994949449
45.887136251457534,4.771245268144527,1429963005013518
45.9307887285695,4.763828645600574,1429963015037777
46.04522266646061,4.8016092793391945,1429963025024980
45.979808739777155,4.81587701253564,1429963034988025
46.01696200477256,4.7949474448942775,1429963044930003
46.01110661394753,4.741458765292326,1429963054974550
46.03193553831399,4.7513783640433935,1429963064989512
45.97963381411949,4.821182085532,1429963075008116
45.992479577604556,4.676802322288476,1429963085068973
45.9479524983183,4.835856890385505,1429963095019269
45.919477597426095,4.721576610085152,1429963105020497
45.961387372718306,4.796538651948303,1429963115017091
45.98652990209302,4.7170486095789625,1429963124963228
46.01710719798143,4.750459041756958,1429963135002150
45.98923329373328,4.713028834554276,1429963144988598
45.90849549389201,4.731863904885113,1429963154990838
45.98901268909828,4.71266346987418,1429963165030583
45.997023796634615,4.7972880543035235,1429963175025928
45.95699242660315,4.739898900761233,1429963185007829
45.91609127410436,4.805109024886254,1429963194972355
45.952212056593616,4.785133271124995,1429963204994411
45.97730867089463,4.7386926969325485,1429963214990606
45.91973929581153,4.737395895088496,1429963225016115
45.937266029562124,4.786209804141595,1429963234974830
45.99709979200719,4.82089772747485,1429963245011630
45.98027289600708,4.843430015316934,1429963254995235
46.02407176355559,4.779945970572732,1429963264976320
46.01043842385329,4.7836816429107225,1429963275038682
46.03497670661475,4.782968912104774,1429963285038058
45.99462692298008,4.742507376039985,1429963295000532
45.966460399409364,4.765268250211858,1429963305032979
46.06888917978939,4.826092826997957,1429963315009655
45.947107501502906,4.795258312425536,1429963325020077
45.98443136486148,4.73323598184164,1429963335000501
46.07024331486301,4.764981732487912,1429963345020956
45.98356758342989,4.79135990530633,1429963355013669
45.983948648840375,4.660297653074084,1429963364998688
46.059869665188145,4.726537104203011,1429963374988420
45.979902575291995,4.746968340025034,1429963384975190
46.03810212862256,4.685244202424547,1429963395023821
45.974682036781424,4.802656597533296,1429963404973681
45.90237472533535,4.739377063873392,1429963414998749
45.93028114792152,4.7760970734276915,1429963424977809
45.912909803195895,4.768057055706021,1429963435030108
45.98252090791889,4.755453850132876,1429963445011001
45.9512714379836,4.786760009976081,1429963454988107
46.00943264515349,4.796302805079829,1429963465031007
45.99703638001078,4.747781192372283,1429963475016595
45.94481316079402,4.670043121735301,1429963484952325
45.99275934154922,4.717521895545859,1429963495019273
46.03209225839096,4.813029343461818,1429963504983333
46.04766399656515,4.668920592812901,1429963515017203
45.963879863675835,4.785212392898236,1429963524980453
45.9735063727116,4.749215449079606,1429963535030729
45.92154009825213,4.77485197893599,1429963544986401
45.97855530177782,4.82985204682357,1429963554971135
46.04167564699999,4.75055676557998,1429963564978212
45.95302383267438,4.712301989848263,1429963574983614
46.01611278139913,4.804557870718924,1429963584920231
45.8516051155133,4.803218847367723,1429963594948490
45.909456323066905,4.817814138364995,1429963604966768
45.99107827855483,4.767995648027261,1429963615042500
46.05915688266356,4.733479190573161,1429963625039303
45.96386104868142,4.7759031970993435,1429963634972978
46.03498843856334,4.736212264723008,1429963644992636
45.922664571975275,4.706585619866102,1429963654930174
45.92957573877421,4.721452718580361,1429963665015562
46.00001256557937,4.786396778426497,1429963674989878
46.054284936529356,4.785470744174036,1429963685003666
46.006648761515656,4.77744571947237,1429963694986644
45.958476259069705,4.732901609169044,1429963705037452
45.975940665349896,4.732844713969034,1429963715003715
45.99334789214869,4.733601448017478,1429963724982803
45.964258760028265,4.729067310253663,1429963734969721
45.94260444848047,4.806103622555691,1429963745003208
46.03376724057238,4.717088540852013,1429963754958268
46.002850963646814,4.773810333209021,1429963765001447
45.96562504120592,4.765733948321526,1429963775050369
45.95635330639432,4.767341790394998,1429963784991508
46.013420163615926,4.8304843178267305,1429963795003128
45.95879518163367,4.753887690130424,1429963804985389
45.948577600965145,4.7638054492945985,1429963815009844
45.96080764548536,4.751009399197111,1429963824981806
45.99815671973927,4.8195417145871655,1429963834981221
45.97919900279102,4.737861459616772,1429963844956674
46.02475891656488,4.737945868973256,1429963855026463
46.01154913504787,4.735825825328324,1429963865047620
46.031983240084145,4.751739140712996,1429963874996238
46.00097950676369,4.783504547950937,1429963884991282
46.0061168124864,4.714359855185251,1429963894998860
45.983174849764076,4.786507973574727,1429963904998359
46.0084802137724,4.7787984233505005,1429963914984372
45.94480260544669,4.729917784250096,1429963925016466
45.99684605745817,4.743166641540767,1429963935023714
46.00719127522121,4.818254721228272,1429963945003541
46.09138658855669,4.700132639237627,1430011094003698
45.98974684167736,4.765517217993116,1430011103986749
46.00250511386162,4.709057782589102,1430011114053448
46.022375275392896,4.6995388095278265,1430011123986155
45.980669112153564,4.706640423355058,1430011134034051
46.067833663475625,4.770519504585512,1430011144015000
45.976199626141735,4.814755181726237,1430011154019480
46.03729113661273,4.804216472535633,1430011164018621
46.00661118260495,4.76506837799883,1430011173955810
45.98842930246233,4.73817747544324,1430011184005303
45.94517295906067,4.681169873902338,1430011194013091
46.04819485476362,4.783175252763404,1430011204007145
45.98507031305916,4.682605376567032,1430011213995192
45.970174985737785,4.801131511566726,1430011223977555
46.016477358281705,4.686429468425335,1430011233982064
46.03369543062816,4.737931826851252,1430011243948834
45.975065034796984,4.788599936547501,1430011254016408
45.99984271321539,4.738580684679399,1430011263976036
46.0765753883832,4.783562030736492,1430011274004080
45.89906161843144,4.6247581745996635,1430011283995495
45.98791302547366,4.823394862578413,1430011293968875
46.00763622859823,4.730808949016593,1430011303988996
45.97011735956841,4.773136405518653,1430011314041786
46.00307923840285,4.789738426504655,1430011323984838
45.99322144300321,4.723241617081695,1430011333975069
45.95879330468716,4.814302010272013,1430011344001921
46.01947379135256,4.734079052331579,1430011354024062
45.977748181326525,4.7533520788479775,1430011364020867
46.08513516246373,4.761556322999844,1430011374004870
45.91753174151822,4.783564867159513,1430011384024915
46.00643054961428,4.796391144730937,1430011393960818
45.943639493818296,4.841256370717097,1430011404004484
45.98293448003232,4.741704116083817,1430011413987536
46.037376939021485,4.80830644844881,1430011423996944
45.97122456595567,4.808535015896949,1430011434011707
45.94332268000209,4.758435379357368,1430011443974271
45.93107612065352,4.753790232142646,1430011453999283
46.02222537140774,4.854513042464661,1430011463963365
46.059957452050725,4.79632350604498,1430011474046650
46.03072969980191,4.723218461074867,1430011483992302
46.01191550887968,4.734139236378393,1430011493999591
45.92440677189418,4.785046128591613,1430011503991339
45.91539569251872,4.726018180936898,1430011513998865
45.99958515813675,4.7013052397142,1430011523987649
45.948807497200605,4.824621192686874,1430011534036112
45.93835060848614,4.742954994609422,1430011544020808
45.91679399058838,4.80679882849206,1430011554001481
45.99768601033678,4.700518776291349,1430011563966485
46.04637475268056,4.813841068030086,1430011574058550
46.0071010105566,4.782185721572048,1430011584008429
45.99378171494041,4.7818975527060035,1430011593999292
45.993926132305766,4.685038098324529,1430011603955518
45.960135464129216,4.809587237767753,1430011613971982
46.01118688138489,4.848677261318717,1430011623991990
46.0287298048097,4.766110767378152,1430011633982196
46.00338688135947,4.647388145569157,1430011643950137
