45.78612966367558,4.913973075194893,1427876204972123
45.77168540408189,4.933029569381348,1427876214981232
45.81769639851076,4.78160317577568,1427876224976920
45.79212375124428,4.8594254543900925,1427876235010896
45.803335996780135,4.92016435277365,1427876244942564
45.80410173427264,4.848207938733226,1427876255030756
45.7558059492263,4.974262577694559,1427876264994094
45.779391362865056,4.869379935044238,1427876275015208
45.75305931035662,4.804684414716918,1427876285005101
45.86673032511549,4.841150926732709,1427876294990682
45.79992276980649,4.918073039984069,1427876304983950
45.85196520812906,4.863407684969965,1427876314991212
45.78222978906715,4.824292823108578,1427876325078471
45.78823333206255,4.9381546268312615,1427876335058207
45.80604975550576,4.871184720326117,1427876345025863
45.8164751992452,4.818779775298894,1427876355016227
45.752318608493574,4.914816370034074,1427876365016232
45.67298266350652,4.917215537494982,1427876374981940
45.804031195536275,4.939226939105485,1427876385021624
45.816551262860145,4.870352985344332,1427876394949188
45.76838490643271,4.795565733156139,1427876404980833
45.85776783781537,4.939624256899636,1427876415028829
45.82506555028868,4.813179502851961,1427876424962129
45.77333645257334,4.870884919034869,1427876434934091
45.79644453724856,4.860920457082384,1427876445066378
45.75174574418721,4.900756392107531,1427876455001238
45.746635242238845,4.897023607505989,1427876464958263
45.72429217512708,4.904130833488669,1427876475038690
45.72996411415002,4.911471501257352,1427876484985978
45.72724896983545,4.900855517445867,1427876495004751
45.832878274058174,4.893199622719189,1427876504960863
45.812737626720526,4.886282577358564,1427876515061841
45.80406603699821,4.91941342675723,1427876524962655
45.77901921502746,4.827910726405461,1427876535057169
45.765497152439146,4.9523034598702305,1427876545024666
45.813567609205826,4.861050869943786,1427876555028044
45.741789291832,4.9128541520436455,1427876565006820
45.75413073596611,4.965141602236548,1427876575014279
45.79567550335794,4.903065922011942,1427876584975650
45.74315952871658,4.853895003276809,1427876595010904
45.74402891180549,4.920057476999158,1427876604992752
45.70543451183832,4.903777897420314,1427876615010463
45.80687610706457,4.94081200179279,1427876624989866
45.72169899653716,4.787090498744061,1427876634958612
45.7693886356802,4.853228441280769,1427876644948431
45.753339930949764,4.851866717195506,1427876655012629
45.77877148433228,4.876090504439021,1427876665016012
45.782367541786826,4.895053935457616,1427876675035330
45.71926902774169,4.863570970245052,1427876685023356
45.810934119052455,4.826980167344295,1427876694973346
45.766174791832796,4.882233646783117,1427876705024945
45.825400401225146,4.758469354719538,1427876714980508
45.78351769875944,4.907975217949844,1427876725005120
45.77500673273957,4.900948124174011,1427876735002910
45.7772313483547,4.847251003838621,1427876745010979
45.83006846516951,4.927781828768111,1427876754956483
45.81868483058424,4.880009953540013,1427876765013676
45.81482383741952,4.807525695100034,1427876774998879
45.77099195246107,4.832355401615091,1427876785053158
45.84799997403305,4.793591567023293,1427876794991438
45.81637186574871,4.92432775626737,1427876805030809
45.8620137562556,4.921944090704642,1427876814986188
45.72272087527871,4.9612082656850465,1427876825063322
45.793405528940774,4.8780847682776205,1427876834969115
45.76303319985672,4.848575936014346,1427876844995617
45.70622164087764,4.846967686567044,1427876855017231
45.72629127207018,4.920344612928271,1427876864970189
45.80463655509993,4.793947151432918,1427876875025182
45.783360954458544,4.865482354449347,1427876885009354
45.73741020229445,4.885425632013027,1427876895036451
45.71158862814598,4.845174729452832,1427876904991592
45.74804896619874,4.900641501671923,1427876914988170
45.77534837403682,4.904102601800677,1427876924995395
45.85176685471213,4.9160155781583095,1427876934985029
45.831871838224146,4.907465203586555,1427876944990764
45.68192835421091,4.902066196014861,1427876955035819
45.79846613938608,4.933531246620159,1427876964998722
45.7870308153819,4.958165223007624,1427876974980398
45.73333520365615,4.833538594352472,1427876984986099
45.767187458076314,4.824652580757356,1427876994997463
45.713067614582584,4.839982903121473,1427877005002515
45.75743664421457,4.932792566013231,1427877014982482
45.764957481419856,4.794035739338634,1427877024993282
45.717754321961785,4.946693719268447,1427877035007626
45.761131546062714,4.9464240899216305,1427877045009177
45.83532751527438,4.864500686537859,1427877055020634
45.755334783049314,4.866571120723111,1427877064988966
45.734032627464785,4.803840016966153,1427877074985139
45.793321564210125,4.9195905812904925,1427877085011390
45.788212758272635,4.840921969167742,1427877094973476
45.860888533349396,4.909549522574565,1427877104972869
45.74422555445481,4.838861332934011,1427877115019705
45.697939660265234,4.89406860844539,1427877125001189
45.764737286201864,4.78241524722667,1427877134980156
45.83100302539596,4.873498542982696,1427877145008221
45.73449523930267,4.91141413831466,1427877155031555
45.761961479828585,4.851514187773842,1427877165027956
45.79607714317578,4.83325984464982,1427877174959326
45.86275289666319,4.832020073846063,1427877185039122
45.804147819907364,4.887932464319233,1427877195003501
45.802209157192316,4.913081853274262,1427877204994793
45.73156368474336,4.869662704809817,1427877214977703
45.872199932069684,4.846567953419772,1427877225008916
45.693509857146694,4.87376137461179,1427877235047306
45.83535518098446,4.780775483111539,1427877244987001
45.81852043746551,4.90876612863365,1427877254977783
45.88295894699521,4.8371598678082695,1427877264992328
45.83474783044096,4.962540561655094,1427877274987438
45.74329630392294,4.8593807258353845,1427877285038476
45.85263241964282,4.820168778293054,1427877295002039
45.821599444875616,4.907717504194794,1427877304998189
45.79241322829727,4.803189875030935,1427877314962696
45.803175607977444,4.914208040513675,1427877325031732
45.78388321448937,4.868460756237866,1427877334995166
45.763010718823104,4.7837794609867315,1427877345040079
45.85498697815113,4.8230784582752495,1427877355051126
45.74591567785197,4.854487138595233,1427877365051261
45.79834037079044,4.8794060092881635,1427877375030094
45.823531215423486,4.87214751705421,1427877384998371
45.7834523959376,4.814861939547166,1427877395029323
45.7947162266104,4.828181068440716,1427877472008445
45.824520768087005,4.853520927378716,1427877481985303
45.79904589729392,4.766774122126565,1427877491986239
45.805900846293504,4.884424126754628,1427877501986346
45.78961659976676,4.886865528321397,1427877511967935
45.742529709953466,4.873505262318875,1427877522014216
45.77458388168857,4.898879306084223,1427877531982487
45.82065116695975,4.8810872051789,1427877541990751
45.73196477944788,4.863318370090824,1427877551986156
45.83051298783092,4.931087540059247,1427877561981693
45.80142383015243,4.799921702217657,1427877571977413
45.81396019833723,4.831391046124664,1427877582036900
45.84701465171691,4.862323684277378,1427877591988382
45.80037002994792,4.910582803004883,1427877601982061
45.72733500319837,4.880480891997437,1427877611957376
45.77072063098588,4.849122156056926,1427877621973156
45.75886023726634,4.853890058658199,1427877631993157
45.78136174848327,4.873634804524931,1427877641957462
45.80678401063542,4.928175298765444,1427877651968260
45.745434488712114,4.856365900865269,1427877662007369
45.830733966403564,4.900302043917991,1427877672014852
45.751961925973035,4.909110098192047,1427877681952639
45.756292639806986,4.836324644327432,1427877691998950
45.744817916130515,4.8433427747461595,1427877701973759
45.6615051655429,4.889012091533775,1427877711959586
45.78592983120607,4.880495850546957,1427877721979677
45.741796463185175,4.945634669939843,1427877732037887
45.86482860345301,4.89151900734006,1427877741960956
45.828621987654316,4.867438818249016,1427877751965086
45.73997255751021,4.896328160801178,1427877761998710
45.76213118172439,4.818911799269069,1427877772003429
45.78032898829481,4.879725099585593,1427877781986914
45.77649740058669,4.814823929560194,1427877791982402
45.72843457423529,4.804730333969673,1427877801992045
45.82665861821719,4.89266005691297,1427877811970203
45.81221143229057,4.826220559392957,1427877822042915
45.786883756890056,4.824352990419165,1427877832008933
45.76540903200439,4.831869736289746,1427877841987959
45.875378076829094,4.856735046392081,1427877852023726
45.74108508345507,4.898931798749101,1427877861980137
45.67029451242599,4.88399961474882,1427877872024856
45.73541467627835,4.917120585949644,1427877882006926
45.85196461254094,4.878188691101034,1427877892010645
45.689393706054304,4.8850385265256175,1427877901978000
45.82770126218711,4.895859309736621,1427877912044127
45.825067490154524,4.857316781879878,1427877922000879
45.846120932481455,4.9301297754167726,1427877932036751
45.74904786906165,4.844965683449514,1427877942051517
45.84158630103292,4.867404906063838,1427877951984279
45.829603343654696,4.86353384462886,1427877962003192
45.725348534530674,4.873232377046425,1427877971989749
45.761939072746216,4.864724296708891,1427877982003763
45.79124180788296,4.83516939159425,1427877992017643
45.790977675180855,4.8888237457630295,1427878002004674
45.865654209977386,4.863794945714709,1427878011976799
45.83462922907404,4.881205285461822,1427878022005079
45.81950667750862,4.864771363079117,1427878031996779
45.8352428724127,4.953632017692223,1427878041987127
45.785839612013156,4.872230633638324,1427878052032886
45.795613560785284,4.796666760493956,1427878062050779
45.83221425560864,4.933945330705823,1427878071956538
45.744079097598295,4.8729022221849325,1427878082004253
45.82624187538963,4.868559474513178,1427878091993459
45.870653110302044,4.881249652796285,1427878101968041
45.84918837983853,4.82486793814262,1427878111932764
45.76512578192041,4.854833774388187,1427878122035129
45.78842844079233,4.831850897948077,1427878132040326
45.844177643844965,4.930896593590535,1427878142006462
45.79094382475434,4.8043416039976625,1427878151962687
45.696811521809295,4.842276850280685,1427878162029148
45.80691134158203,4.922905246554779,1427878172024740
45.80555741040076,4.872390191418246,1427878182041856
45.75517730052998,4.884449212650437,1427878191992728
45.77128233009058,4.962209441134601,1427878201988248
45.79952634645157,4.8871094217898445,1427878211963533
45.8004613031488,4.82389539407775,1427878222013578
45.79637903232023,4.8176144430532215,1427878232010479
45.70819341141339,4.874502045669322,1427878242041886
45.7349407597509,4.903328482906352,1427878251983743
45.71070698133491,4.857742832663661,1427878261984742
45.80209576204249,4.8461614869297955,1427878272024980
45.84996571423821,4.887465545052123,1427878282020587
45.79969803792054,4.83673627549493,1427878292038656
45.78910130093292,4.843235418093364,1427878301988038
45.8873334750222,4.831525662509975,1427878312008143
45.74676568579202,4.842024506196445,1427878321997337
45.90674954668147,4.8535757960326285,1427878332025684
45.76027370230274,4.886756586474596,1427878341993162
45.77799900256947,4.948924007128475,1427878351947979
45.79509863405483,4.850113672673509,1427878362059840
45.75918752430139,4.864973004553072,1427878371968675
45.785691735944674,4.8747812576274905,1427878381993601
45.7458604596714,4.732576780310645,1427878391989148
45.78065651963967,4.875527236259879,1427878401944591
45.74389433796759,4.820246045003513,1427878411989414
45.72733035043358,4.87594048327161,1427878422029544
45.85351828752528,4.80285289366074,1427878431988462
45.75913334975765,4.902404693777343,1427878441992183
45.81921592139756,4.861442144364756,1427878451948726
45.80320437271964,4.8589826029929135,1427878461954750
45.775749395660185,4.84608765782049,1427878472011366
45.798630650695614,4.876950320967299,1427878481992776
45.72120912423926,4.871091335373944,1427878492001253
45.76901888002393,4.855829126035232,1427878501999393
45.792825972551995,4.873106492708038,1427878512014147
45.7549013457919,4.866214388602632,1427878521991231
45.748948840382,4.912013538586519,1427878531980395
45.73853863494424,4.842633182855637,1427878541953032
45.790954221338275,4.86494434317579,1427878551986316
45.74145730608183,4.916135073855509,1427878561968994
45.817451963527844,4.859243913606629,1427878571995922
45.819882708168166,4.824457202705914,1427878581994499
45.74757329923922,4.827535390794658,1427878592010954
45.825429040406966,4.930720737839118,1427878602035746
45.8240281589085,4.914939022923207,1427878612029259
45.79298334389654,4.828546776714687,1427878622034156
45.80398070448427,4.895165606931485,1427878632037392
45.77857029221744,4.8747070383679505,1427878641981377
45.64313537595616,4.894631949496597,1427878652034689
45.77052576071412,4.910317446298709,1427878662002278
45.78902677863805,4.8575886120752045,1427878672031768
45.73099708712268,4.892336613969544,1427878681999556
45.79339431694123,4.941916713001066,1427878691970652
45.741425014387005,4.813071072213593,1427879271990693
45.720335282596025,4.807377702554506,1427879281984935
45.83593389653915,4.834538077322687,1427879292014641
45.73258919484057,4.904133135586289,1427879302004961
45.72405403128605,4.906039129583323,1427879312017954
45.778756776450294,4.901014890927292,1427879321995832
45.87658891101267,4.827919819024984,1427879331984664
45.775097788542894,4.85270085377933,1427879341998199
45.751699555441654,4.868019852176919,1427879352020690
45.75426959048979,4.843172116442897,1427879361967829
45.756767320391965,4.903657657910292,1427879372001670
45.77091516391546,4.846589139036533,1427879381921235
45.80661300404863,4.843210891977027,1427879392015469
45.78057316238833,4.900827807413655,1427879402052957
45.81239132189556,4.863608390548581,1427879411992556
45.72273718810345,4.911936565024348,1427879421966140
45.747023143266944,4.907063971393765,1427879432001892
45.733995371123235,4.788956810701225,1427879441961346
45.76085473933051,4.856508512497489,1427879452001153
45.80024485620602,4.816010701724616,1427879462040704
45.79741828570119,4.922645301192777,1427879472014929
45.77679942723877,4.844742189073231,1427879482058134
45.829267535222144,4.880207798670932,1427879492010234
45.82951816831228,4.827362183787561,1427879501951148
45.80726797025939,4.87072385354276,1427879511991839
45.762236154172754,4.927920173586078,1427879522001074
45.859638282406856,4.844584835355438,1427879532022236
45.770741894256034,4.903237812575535,1427879541981178
45.79711683852921,4.902823192930999,1427879552047424
45.733470251025686,4.842564108640468,1427879562010018
45.85457000507874,4.840618744091638,1427879571984359
45.74773525067625,4.846610264225481,1427879582002838
45.77179980485201,4.99006213962617,1427879591988705
45.70137414152629,4.847602656919218,1427879601978765
45.79669238618555,4.852744209612392,1427879612012758
45.80313181604297,4.8793479940309705,1427879621944885
45.82734914266,4.868860524671556,1427879631995649
45.78417080648439,4.910793077113898,1427879642028149
45.73885355719472,4.805677360707804,1427879651991845
45.80177236615746,4.896253552095978,1427879662010726
45.70147632163921,4.881851647819756,1427879671963404
45.774805251120945,4.889103132783112,1427879681978618
45.78809041138063,4.845210340164987,1427879691970103
45.81631335304378,4.818217140515051,1427879701978339
45.788785512984276,4.826338287445069,1427879711981092
45.70249884041203,4.907732656904602,1427879721999169
45.73894102613662,4.876012875275744,1427879731950815
45.82020217195274,4.865106881378947,1427879742017942
45.804163507318954,4.968579345449543,1427879752003117
45.76615758750455,4.880357771946342,1427879762029495
45.82477142595613,4.823742040714626,1427879771978277
45.81012081620663,4.931749607666637,1427879781968785
45.83963774630695,4.935923823069485,1427879791979368
45.732133373304926,4.862621401531292,1427879801975870
45.757754413828934,4.91919245386296,1427879811981472
45.86884011598069,4.8984546722215665,1427879822009420
45.75847201157206,4.9645782431148,1427879832022305
45.811103112314484,4.894521390412815,1427879842035842
45.79593896623482,4.857087579506326,1427879852042890
45.73110648578409,4.903684808402264,1427879861992399
45.744529108796605,4.917561215273667,1427879872004603
45.8464193831064,4.904449103298207,1427879882006394
45.721865642283255,4.858423138737322,1427879891944185
45.77856436560239,4.834571759052313,1427879901959569
45.83705697072072,4.918187363387743,1427879912012570
45.78113484129537,4.810526708720062,1427879921944521
45.73272610734136,4.928208775641844,1427879932020534
45.82977809556314,4.860608817236529,1427879942044982
45.751633136464214,4.8527229615456875,1427879951979439
45.84315332452636,4.867033769560063,1427879962071256
45.79796064298904,4.828301279507046,1427879971987530
45.76883131615898,4.915753593557976,1427879981982267
45.75720944360036,4.824717524088242,1427879992012464
45.79118162827119,4.8969807433157495,1427880001990208
45.751418167395975,4.837961725980321,1427880012035094
45.77421697327512,4.838173342744569,1427880021995264
45.684990902391405,4.852889416602974,1427880032024455
45.76165880963822,4.942549530659207,1427880041927706
45.83671827893667,4.893821976894625,1427880051992264
45.78572103387208,4.823778491777177,1427880062024359
45.744337116223434,4.904985121743687,1427880071991958
45.72245153510297,4.85448500992442,1427880081999449
45.7031229423139,4.833042227370624,1427880091989592
45.7646024344556,4.848190953167004,1427880101995600
45.74573276618273,4.892745616196855,1427880111994765
45.74405810580713,4.826261432705125,1427880122031000
45.846808908825686,4.880903579614495,1427880131978906
45.76331807814409,4.914557677897591,1427880141966857
45.79518458792639,4.941808463704296,1427880151990590
45.86890901681111,4.854611232139011,1427880161980786
45.735287063082595,4.875408342880276,1427880171973548
45.768415401194474,4.86771116714027,1427880181973920
45.85031671896427,4.90071572111607,1427880191996813
45.811438800046574,4.840178270216763,1427880202031191
45.67347296171695,4.8642249839104945,1427880212015028
45.7127832460897,4.87580797599187,1427880221991462
45.81281371563393,4.914686696437859,1427880232045785
45.78397407856879,4.844341021279787,1427880241993050
45.66703345328662,4.787283932446629,1427880251982110
45.84140947782806,4.8420259860950265,1427880261978294
45.79633518970584,4.826533864367345,1427880271941445
45.82628605881662,4.835675315329334,1427880281969433
45.85094548378192,4.852316251863808,1427880292004081
45.76398080650943,4.8785499939523405,1427880301962934
45.78749113766108,4.851855699459962,1427880312004251
45.81033340893038,4.868047090036854,1427880322060647
45.71502798713128,4.911835482246244,1427880332039166
45.8562291956457,4.886358864716324,1427880341992636
45.74342108243643,4.836932655349967,1427880351984715
45.73992353852696,4.884399114511107,1427880362003168
45.761585659723465,4.79981881165809,1427880372004023
45.79498749027367,4.907710006602741,1427880381992330
45.79143336171723,4.796384653965967,1427880391980729
45.843670699117716,4.933080322433102,1427880402012561
45.78142963110936,4.921204188552978,1427880411961529
45.801549706977525,4.808239901640259,1427880422026717
45.70789084549185,4.843051259217141,1427880432012196
45.816286443509775,4.8743323757650945,1427880441992897
45.81218194231579,4.9151643477033575,1427880452031667
45.773030742070276,4.929353761797832,1427880462007265
45.777343846857924,4.914968055667626,1427880471982913
45.83569807655443,4.931428912667228,1427880481992659
45.7753575657594,4.825950513971089,1427880491970635
45.75479727211855,4.818978886972255,1427880501994965
45.73455223370557,4.896529746637619,1427880511956080
45.73879365247225,4.874606060739775,1427880522051666
45.79177259225239,4.819122187622399,1427880532009722
45.776012168596004,4.902706116830717,1427880541992323
45.78536401384878,4.851429106060024,1427880551974237
45.70725687503184,4.8692504939362555,1427880561924299
45.73584776369101,4.87914969338757,1427880571962844
45.79053693145176,4.84158872551921,1427880582033543
45.81912115670562,4.874450613437246,1427880592012606
45.78395142654576,4.860636833638259,1427880602010847
45.70374289040007,4.89540697808363,1427880612069721
45.775889635139315,4.937500212331819,1427880622024130
45.80282411481789,4.830897629606363,1427880632018035
45.730064708897764,4.88488330793623,1427880641994501
45.768151862110784,4.873213606962992,1427880652013981
45.77441008472489,4.901170648635489,1427880662001830
45.786245423410506,4.867319734208852,1427880672018690
45.77712290547493,4.901363877624949,1427880682008087
45.749031595100405,4.869429943698231,1427880692009531
45.75121424790381,4.808234348070506,1427880702002273
45.81367639731126,4.874018399778288,1427880711976996
45.82623199135385,4.904690181603565,1427880722000976
45.817140708949466,4.925491438121856,1427880732009258
45.76586654993947,4.853496929948691,1427880742024071
45.826441710942,4.924723546070429,1427880751995665
45.7707603384177,4.891380892733439,1427880761994075
45.80240032267803,4.910155879375754,1427880772006448
45.82451602807561,4.786001554152486,1427880781952515
45.75294214668088,4.844706427019487,1427880792023763
45.774655431154436,4.875947023020237,1427880801998794
45.75862939058689,4.916173057948493,1427880812007715
45.81594926644599,4.830378663321925,1427880821998964
45.86271980583424,4.944417182119599,1427880831952439
45.74928939457899,4.89302409212521,1427880841987970
45.689693105375014,4.817636940774001,1427880851992563
45.82561608921933,4.837436553132135,1427880861992367
45.76184791962792,4.901889938708646,1427880871967101
45.85268470465089,4.828355518004897,1427880881985902
45.74099255585331,4.884550158148782,1427880891970339
45.71115118002749,4.892408532479893,1427880901976030
45.86058425493639,4.851111249481988,1427880911999975
45.76120745007868,4.868498286307697,1427880921968409
45.74150920063755,4.844439322597034,1427880931981035
45.79033133535614,4.876760856835112,1427880941972930
45.82436110077139,4.83063695293322,1427880951988379
45.760084192823875,4.90918777612445,1427880962033229
45.78896017770121,4.9029563433714864,1427880972004485
45.69323087072287,4.831487989431751,1427880982008494
45.69780519314412,4.8509939712135735,1427880991975378
45.753860787273155,4.79491550064734,1427881001959060
45.73808976176129,4.847200042540677,1427881012007000
45.73760731725809,4.8485052571167016,1427881022020952
45.84025954618592,4.817044639866554,1427881032001281
45.76472510989518,4.821050000253428,1427881042007432
45.76895238005035,4.787713788571757,1427881051992779
45.7226791411324,4.998866683810391,1427881062007694
45.765178959526594,4.832126283731394,1427882378937382
45.80155579913508,4.821394218883105,1427882389040454
45.8036719894479,4.897980128559124,1427882398985648
45.75258912708516,4.933446191935148,1427882408985613
45.81631999728932,4.938657376202702,1427882419023756
45.78945668907117,4.868176760184779,1427882429031796
45.8121342580675,4.872909020910833,1427882439030532
45.74342443434361,4.870216908842956,1427882449034950
45.80907376536721,4.86423367752257,1427882459009882
45.808476872421934,4.861671030063297,1427882468957699
45.79364589253433,4.789445052620317,1427882478946154
45.765400852219386,4.894181257803085,1427882488972983
45.75786672093571,4.924374903020458,1427882498987180
45.890317274053864,4.926930810405263,1427882508969017
45.74290739189741,4.884737250735256,1427882519047699
45.74325752982921,4.903898973573622,1427882529006291
45.729951496558925,4.883315360265853,1427882539027078
45.851705226578844,4.9101628310742935,1427882548983398
45.754273723367604,4.86878552739193,1427882559004654
45.73670543201773,4.85731519562451,1427882568997125
45.75846003858651,4.861022376391585,1427882578962794
45.74911041384574,4.810290352841852,1427882589002775
45.80095628221166,4.852366681549565,1427882599024457
45.79170811365603,4.893918683282369,1427882608993231
45.76175656840562,4.98243243026785,1427882619023334
45.82578322532324,4.912375046808479,1427882629004107
45.81526246356247,4.883415343207386,1427882639008909
45.79200717828308,4.840428062880295,1427882649023115
45.8121765622245,4.904150204354271,1427882659001665
45.78998296868248,4.854549028471424,1427882668954350
45.77072689161827,4.78945718459298,1427882678999268
45.755885603277335,4.913179540216418,1427882689026426
45.750212206178034,4.906526886921617,1427882699005282
45.74853873998837,4.891581415293644,1427882709056638
45.80070591834216,4.974186163234623,1427882719015728
45.81406908599762,4.872865028893584,1427882729006226
45.81022200797539,4.88144506536136,1427882739053969
45.81385746341465,4.8763387325378,1427882749046283
45.84798987751529,4.911913604689002,1427882758983744
45.802176121145244,4.7577793201298855,1427882769028659
45.79465848147778,4.828927494262339,1427882779003703
45.73572077751228,4.848935265144591,1427882789024289
45.7906712671159,4.92171524597101,1427882799023472
45.753080253360324,4.863961722340398,1427882809029631
45.82914287558478,4.951134481989636,1427882818985648
45.76146856351528,4.886286414000639,1427882828984442
45.73580272593536,4.881393218013324,1427882838993864
45.81467113827975,4.836973862272716,1427882848934505
45.7220325563165,4.8679810370095415,1427882858994968
45.80412163391843,4.843576744805533,1427882868984823
45.75746458865919,4.833473153594307,1427882878909278
45.7684243797082,4.872302311881836,1427882888991754
45.788483715197124,4.83719654278412,1427882899037895
45.74860504602638,4.84796897953128,1427882908996858
45.772561886843604,4.835008186756427,1427882918972290
45.753658636583225,4.850162002416581,1427882928992032
45.78481622551347,4.908455950551479,1427882939039874
45.775194778011006,4.833644360889053,1427882949032325
45.7513622943857,4.8925877761760175,1427882958956051
45.72826135154938,4.910299563856196,1427882968938545
45.84084694961223,4.830636610929689,1427882979015677
45.77484525411186,4.929678765714355,1427882989031948
45.74192690054829,4.885641717082263,1427882998990204
45.77754913045657,4.859278894138532,1427883008995122
45.84278919981137,4.890421352174485,1427883019056765
45.76179930322602,4.911524799412718,1427883029007317
45.81042647235521,4.843903497833324,1427883039030325
45.67761980384739,4.887470926169316,1427883049005746
45.795511743512584,4.891257110637997,1427883058983337
45.81908204310119,4.962040315266177,1427883069013567
45.80545023627523,4.937470061895673,1427883078959692
45.79105879916848,4.899470917429505,1427883089002846
45.752278916586675,4.893079585722861,1427883098986065
45.78119449686495,4.884349027700285,1427883109010168
45.84164214144405,4.857803442611316,1427883119016639
45.731109725380044,4.887008302007197,1427883129003564
45.7836775028913,4.928065718758754,1427883139037881
45.82186541026802,4.827276557466709,1427883148961552
45.91555247136935,4.871508538162394,1427883158982004
45.69787848484278,4.925029583169539,1427883168961812
45.844375446291124,4.884492601271828,1427883179053508
45.73755889574571,4.9253718658562935,1427883188976292
45.86239411687573,4.812957415047048,1427883198992305
45.75890989400352,4.896959064009132,1427883208990925
45.715495512571195,4.854934501436347,1427883219021923
45.76192774969546,4.914182823636345,1427883229004671
45.75671967712115,4.854695101448209,1427883239019065
45.82046911309583,4.787282907928598,1427883249000263
45.82378815125193,4.931578208392614,1427883258994013
45.79896680490531,4.850842201857742,1427883269001458
45.779108860496855,4.917760667381043,1427883278960490
45.83666127103036,4.9292490263902495,1427883289011773
45.91326584760837,4.81883392212609,1427883298984944
45.79654480769473,4.845809183411342,1427883309058674
45.78764250075543,4.929619299015506,1427883318980967
45.82677459288328,4.917992422154405,1427883329011659
45.65188728521857,4.894340960134064,1427883339002104
45.78981299557303,4.8548693418099305,1427883349056313
45.78147456002151,4.8916945799731355,1427883358983021
45.81063057310261,4.850760605967866,1427883368979445
45.75467694627346,4.803099562145479,1427883379003025
45.68850066466007,4.8939813060515664,1427883389041974
45.76766383780089,4.857622470206087,1427883399030015
45.81715327494547,4.841352162656318,1427883408959585
45.8093916549977,4.893652926177761,1427883418992199
45.873317916789226,4.8802375635753075,1427883429023038
45.80663314411969,4.915851708190466,1427883439038629
45.757512258572994,4.8688917162666705,1427883449025966
45.84047073338536,4.892205218152788,1427883459015367
45.883870341068096,4.793772599759652,1427883468983624
45.831218757039174,4.8803185058408225,1427883479007851
45.84707016242964,4.906258280027221,1427883488927217
45.77492856095062,4.8516000510572335,1427883498969397
45.7826568862046,4.825173959376536,1427883508962871
45.81933795693239,4.879164866631149,1427883518986478
45.761134815043754,4.859867066727086,1427883529029238
45.74021071249738,4.905027906740662,1427883538990368
45.83040343095968,4.8693632554198905,1427883548980150
45.72998484309627,4.843642188195525,1427883559022084
45.8088989666616,4.915944202084221,1427883568991123
45.783231280273945,4.838178046133803,1427883579042109
45.747547836101646,4.820568135582267,1427883588986940
45.83236545625281,4.899780148492276,1427883599015953
45.744089403451476,4.888247835018468,1427883609025866
45.72872408705278,4.86056708613675,1427883618978743
45.75781014771487,4.7912253968893825,1427883629011866
45.743651189021584,4.8965768939456344,1427883639019445
45.764554363908054,4.865566058590425,1427883648962722
45.766215595029145,4.896680414665532,1427883658945663
45.76315514183253,4.883530338659243,1427883668979017
45.828498141639464,4.861752661260434,1427883678998082
45.86178548337932,4.808112058656413,1427883689023571
45.83962965507889,4.848920999572235,1427883698966405
45.777103734895086,4.844857969372935,1427883708977884
45.72740812778135,4.90216598291587,1427883718983526
45.828132013952235,4.911706802131005,1427883729010017
45.66519039805679,4.806416851504274,1427883739007314
45.78724610123273,4.859774230496503,1427883749011442
45.74794935996132,4.83574201952922,1427883759056573
45.837204913444204,4.888051411680627,1427883769057601
45.897421132037316,4.873657393007779,1427883778970748
45.84552087755834,4.844035762734588,1427883788967686
45.802674424871036,4.910671412041026,1427883798989970
45.813065253535314,4.85780704505835,1427883809022875
45.74883666903844,4.907614537611565,1427883819006231
45.81176227460172,4.874949233409999,1427883829006580
45.675544209632726,4.8865243768528055,1427883838945622
45.81788058228886,4.809481356331579,1427883849011306
45.77070650952326,4.807915168194772,1427883859034321
45.791381247772605,4.9504428419922455,1427883869008084
45.777419427506246,4.880559598585705,1427883879043031
45.82362390415745,4.777873666643379,1427883889001155
45.72311720448296,4.928273899475375,1427883899021374
45.75279499216723,4.888708200212039,1427883908970128
45.79910304287257,4.918339735757194,1427883919032380
45.800089188655555,4.871303283678974,1427883928943184
45.707811484817285,4.844518093432438,1427883939018634
45.75761675698642,4.921486946871062,1427883948966213
45.74530628505943,4.936358856164923,1427883958997457
45.86551551993536,4.921619895430116,1427883968988685
45.78816174783401,4.882584212887004,1427883978984956
45.85125861534271,4.973587367125445,1427883988999437
45.732412452884525,4.863939577928736,1427883998997304
45.739025584257995,4.851206940593905,1427884009007925
45.86835457400554,4.835017314603923,1427884018999041
45.76900152914141,4.868405199905266,1427884029017331
45.80684720983217,4.872949904185777,1427884039038017
45.80638904096745,4.91724885779346,1427884049012334
45.768460499636305,4.8321698903400465,1427884058984652
45.69929376687923,4.859551326682084,1427884068979603
45.75897414784365,4.914702169238082,1427884079010979
45.775215996321876,4.785781838612235,1427884088991543
45.74265355988774,4.91606300112816,1427884098935701
45.74166041551001,4.826543694120473,1427884108996788
45.80476387548146,4.930863173692449,1427884118988552
45.76450159285689,4.922346670733092,1427884128957357
45.8155663465672,4.834580200400902,1427884139006875
45.78705272015181,4.8448969775465205,1427884148975307
45.842825688216415,4.89296736075328,1427884159078384
45.862123062709856,4.818361271933476,1427884169000109
45.741700723069656,4.86786032830321,1427884179017490
45.793541842837,4.891306063806218,1427884189030444
45.82196280280026,4.91622893420581,1427884198981213
45.75065923737004,4.923768790201689,1427884209032512
45.79663474259494,4.8103648315612695,1427884218984828
45.79715622208589,4.90501787700495,1427884228998746
45.77057766181838,4.85804680005253,1427884239021929
45.823553614555465,4.830798889405457,1427884249018733
45.781307630722175,4.9152405428672115,1427884259045598
45.76281131429253,4.867129230113216,1427884268988454
45.80675302019404,4.931496577872124,1427884279002788
45.6885625349137,4.8283996470269335,1427884289013051
45.73621084831417,4.867244428496135,1427884299021261
45.826755816472414,4.882361657243464,1427884308991112
45.80097221721378,4.827764655024358,1427884318990172
45.7732150958746,4.906391321664982,1427884328982913
45.80098231076881,4.899938733186719,1427884339025259
45.74068855232727,4.879289618799093,1427884349008568
45.793639762708764,4.831143272363731,1427884358979716
45.80101549647727,4.8412490923521805,1427884369020960
45.82312720964221,4.913115362331488,1427884379028149
45.806925123274695,4.950107306516466,1427884388984227
45.769638072876035,4.888644403596787,1427884399002285
45.787801605432264,4.867269275618798,1427884409023487
45.7900838021977,4.868840296688698,1427884419046713
45.804951118470996,4.875490137693208,1427884428932789
45.77216509918311,4.8115663938063555,1427884439030216
45.733083734089206,4.868642048291217,1427884448988113
45.69222089767613,4.856136125582966,1427884459008460
45.840577517517126,4.81551173158788,1427884468992525
45.852762396278685,4.86423626211668,1427884479003060
45.774835566052815,4.847978510252325,1427884489025816
45.82655893566524,4.79666253376472,1427884498981378
45.76270300486515,4.875339949489153,1427884508971016
45.755729959503775,4.898582476906098,1427884519039086
45.80231586051896,4.778584170280686,1427884529040626
45.80232340026503,4.842112453194419,1427884538961505
45.76742306572637,4.901089421620682,1427884548994179
45.87708561839871,4.911713685989799,1427884558978198
45.79149624410483,4.8600712325982505,1427884568948217
45.787959005783385,4.9066253254458365,1427884578924369
45.83121724064311,4.841741047212008,1427884589017017
45.81931422465178,4.94006149029738,1427884598980755
45.83505593304237,4.895577060239106,1427884608959263
45.81975308285015,4.8532343685693045,1427884618973870
45.77560314908966,4.8982958466581215,1427884629000707
45.80424592154845,4.880729807861313,1427884639033011
45.79270507566004,4.8995950751017086,1427884648932892
45.835957121256904,4.901360749496096,1427884659009148
45.72800564363497,4.867508405139006,1427884669029456
45.827512784123954,4.867640980027373,1427884678989500
45.8533350639132,4.851612383371922,1427884689011239
45.77967283903529,4.858339539478854,1427884699044144
45.76252361718618,4.982431497081409,1427884708993425
45.77181707270575,4.87614948241128,1427884719016905
45.80185165282647,4.874049373848593,1427884728959581
45.79977177173054,4.847619130846848,1427884738948231
45.719400184641515,4.849605291987906,1427884748966083
45.78977148751657,4.837399680409575,1427884759004924
45.81354747236913,4.888392884412339,1427884769003343
45.75866386302594,4.873904752623096,1427884779017335
45.78035510409526,4.866101198716189,1427884789000112
45.716533765855225,4.863127734315942,1427884799024783
45.729592237376124,4.889233590515906,1427884809005624
45.793213656193316,4.925123627249296,1427884819022019
45.84675040542707,4.835029835088756,1427884828951934
45.78469276288974,4.838917715399631,1427884839023893
45.72008514954446,4.822131107731438,1427884848974113
45.75556998097235,4.808400470631695,1427884858988951
45.82141806543877,4.828624147605965,1427884868993065
45.83478942244681,4.896873843260109,1427884879030703
45.777908121229196,4.8563407036914015,1427884888993755
45.80909698928028,4.858182389420543,1427884898981981
45.77806516961925,4.849335650444973,1427884909032179
45.69572523583836,4.804393079729091,1427884918972081
45.805888410345304,4.89467797460596,1427884929004878
45.878690814562376,4.863997597053471,1427884939028226
45.819948739439546,4.855762091353676,1427884949019532
45.74909592552931,4.917001454575482,1427884959013386
45.760805703754905,4.859149800162012,1427884968982688
45.80848004180295,4.921565669128454,1427884978997400
45.80636432672403,4.911766888593022,1427884988986707
45.777830158594874,4.8347534303507285,1427884999040297
45.77085022188149,4.883021404132053,1427885009012509
45.7919174420161,4.836231089083064,1427885018982370
45.745487899035155,4.874977109405819,1427885028966291
45.80059316568851,4.802424082263787,1427885039000678
45.789673791297616,4.896347202716553,1427885048986545
45.73950076245024,4.900232650260961,1427885059017076
45.77731089681993,4.890789125084188,1427885068982654
45.84377014586067,4.813008389816702,1427885079021812
45.680554151830805,4.8343509083314125,1427885089016622
45.809352017217,4.860888628727818,1427885104007306
45.748658189970676,4.903360501398212,1427885113955199
45.738755591477656,4.888102399104714,1427885124044690
45.85298931371301,4.901599257721088,1427885134002421
45.83150528921409,4.882747614806146,1427885143945920
45.81315259054669,4.868032476104487,1427885153965292
45.780224193097155,4.785778367796473,1427885164021621
45.84494666688177,4.799452777774092,1427885173982298
45.80290076155155,4.858706354594609,1427885184035967
45.816618726244414,4.899147534268897,1427885194007576
45.78631793230761,4.850464388692218,1427885203986248
45.82670978477454,4.962701641043486,1427885214035220
45.7524982998093,4.910304410054735,1427885223978466
45.83893651671608,4.875992199717168,1427885233977874
45.78568966209745,4.966609665545723,1427885244031095
45.82451866053254,4.871799767229662,1427885254004872
45.80367124859726,4.871247783613764,1427885264001370
45.769874691966876,4.864900770853377,1427885274000086
45.743694178674424,4.902818514083113,1427885284061097
45.755645584780545,4.841023153110995,1427885293953337
