46.16134574631464,4.044961261282831,1429279555000581
46.16648734934295,4.052980494066871,1429279564996720
46.165167337396454,4.056184872937548,1429279574997282
46.16436736571281,4.0662528037650905,1429279584995544
46.16751757727743,4.051912500129816,1429279595004480
46.15939520136543,4.057372627276632,1429279605006444
46.163581907379104,4.05569261828791,1429279614994871
46.15633265039327,4.058196853824415,1429279625000597
46.152898179799,4.059814485411909,1429279634997653
46.15388575893466,4.0607824979567,1429279644992923
46.15646904968483,4.04880132394918,1429279654994744
46.15765901415959,4.043852473205332,1429279664997345
46.16638501225967,4.05398118880858,1429279675001441
46.156807182675415,4.049698197283708,1429279684996956
46.175207677765975,4.045611785699274,1429279695007207
46.16126684321526,4.042254657432037,1429279704992991
46.16605249578484,4.042788600987271,1429279715003256
46.15297603357615,4.0530177925236845,1429279724996053
46.155163963518206,4.052608217588274,1429279735001716
46.156038673694574,4.04149964099237,1429279744996829
46.15535944183463,4.036964031094808,1429279754997182
46.15667999431398,4.047676443884833,1429279764998466
46.153382414437395,4.0415131540106985,1429279774999316
46.144852242474514,4.038137018441581,1429279784999245
46.1518749462742,4.0384743104435765,1429279795001420
46.15537044779236,4.048843594009732,1429279804997111
46.14515918074188,4.043064629982519,1429279814999870
46.15116559349954,4.045088504585687,1429279825003865
46.1529414698689,4.040122329347788,1429279834997620
46.14602891667421,4.035596578782143,1429279844998542
46.14738142539165,4.052741080629281,1429279854998964
46.154634801076654,4.0485469819132565,1429279864999606
46.143314524013725,4.051942418923001,1429279875003107
46.150333956300834,4.051562430450863,1429279884998639
46.14737839603604,4.049893637220987,1429279894995921
46.14885477446135,4.050985255978601,1429279905005410
46.155522250330776,4.058396339230059,1429279914997138
46.14602760766443,4.056206234749919,1429279925003260
46.14581857716213,4.05408507835076,1429279934999013
46.13766249348485,4.059747569592297,1429279945004312
46.142110556825465,4.067527218548947,1429279955000712
46.14741206832784,4.0622927565877305,1429279965002859
46.14422407785002,4.068983116875492,1429279974999381
46.13732492660071,4.069817599311341,1429279985000959
46.138380508620834,4.072664396264966,1429279994998597
46.13469755029889,4.075015112896543,1429280005004987
46.129910914524714,4.084679459305371,1429280014994937
46.1331108346008,4.076748683317592,1429280025001142
46.130843982607075,4.0736697781111015,1429280034999873
46.13888953322452,4.07953078569522,1429280045002165
45.94593502187192,4.246293321023984,1429281433998410
45.939945099915676,4.243533733294241,1429281444005957
45.937166222301066,4.258013455784796,1429281453999972
45.93593456787621,4.258504521301491,1429281464002896
45.93868890070052,4.253358262196463,1429281473999756
45.94255397105793,4.2706979681310715,1429281483997760
45.95093178721655,4.262426103830435,1429281493994102
45.94766039236895,4.270904694428116,1429281503998630
45.94530034724788,4.2685167873410785,1429281514000585
45.93500444773172,4.271564839034382,1429281524003312
45.9383117050332,4.27585355527241,1429281534000021
45.94795681163649,4.278826266458634,1429281543997948
45.94560701152581,4.286915896107807,1429281554002929
45.94903987266983,4.28499588867801,1429281563998460
45.94312240460113,4.287254964954965,1429281574000774
45.93290566843823,4.291165151426086,1429281583997523
45.93317089750156,4.289928593236046,1429281594004460
45.9353709821635,4.293209109944052,1429281603998971
45.936297403186096,4.297576770594158,1429281613999855
45.93534053533658,4.297806914448288,1429281623997271
45.93884874662709,4.308980414700685,1429281634001678
45.9280861418949,4.299406734422035,1429281643999964
45.93611107651231,4.304658195637874,1429281653999350
45.91839786651919,4.307005607397865,1429281664000921
45.93239606470731,4.310276298601649,1429281673999876
45.924099154178556,4.30986048315536,1429281684000647
45.91966133202583,4.305662129104677,1429281693999739
45.924400226569446,4.311685254031887,1429281703997550
45.92076447550447,4.317783694586153,1429281714004499
45.91951976182167,4.316362078490784,1429281723997183
45.91452587557882,4.325467260680822,1429281734002177
45.91102889981484,4.327882139260977,1429281743990791
45.92099694204654,4.3260417462115,1429281754003133
45.921152563589885,4.328697640062806,1429281763997089
45.92409838842668,4.32449469302866,1429281774004396
45.905831309730985,4.334607304564473,1429281783999490
45.92389393509379,4.33267761091709,1429281794003000
45.91871087422133,4.350022686932219,1429281804007299
45.915362418549314,4.339062179812095,1429281814002632
45.91522914023173,4.3423765641814525,1429281823999565
45.91311942489242,4.346570947137413,1429281834004456
45.91315132301488,4.346992178474091,1429281844003005
45.851144583649635,4.568848594360536,1429283264003978
45.858708311604715,4.573080307492328,1429283273998633
45.85390874723114,4.5812101690558045,1429283283996199
45.84608072081447,4.585783746746528,1429283293995071
45.85290303826335,4.575084850150617,1429283303999463
45.85444113453674,4.57174051224894,1429283314003089
45.846161830400426,4.586020598979043,1429283324002708
45.84067258003452,4.5808357569321,1429283333997406
45.85351218487817,4.577806272012769,1429283344001159
45.84446916495109,4.582651836786864,1429283354003914
45.84569803333679,4.583035880818185,1429283363998200
45.843822890675035,4.583842091546351,1429283374000585
45.85306542143648,4.582490125441006,1429283384003313
45.84876346304885,4.592649297620233,1429283394003359
45.841262563375686,4.586364795858879,1429283403999497
45.84090437251806,4.591728349813236,1429283414002896
45.846118698758694,4.593246816643175,1429283423999173
45.845597886951225,4.596473289086365,1429283434003765
45.84618237318785,4.604937621783301,1429283444004539
45.83731701651197,4.5927018357249185,1429283454002220
45.844182488991706,4.60544687743581,1429283464002185
45.847749421842096,4.610441259749615,1429283473996446
45.84398735687262,4.6087659011525615,1429283483999155
45.838503218758504,4.608678551111374,1429283494007408
45.838611718847176,4.607489524227201,1429283504000695
45.8396442624792,4.613003873359745,1429283513994903
45.838685525048255,4.608548188383639,1429283524001741
45.83508583218548,4.611824789786946,1429283534000131
45.83680678379039,4.614446312620751,1429283543998823
45.84195537702121,4.613978396660857,1429283554001902
45.835604350094194,4.619126066615455,1429283563998102
45.84372939082957,4.617529193274181,1429283574000120
45.83580011669023,4.621853956758772,1429283583998966
45.83721640712959,4.627265561814171,1429283593997725
45.83543668956412,4.622747772144253,1429283604001152
45.833869939068,4.625453156166606,1429283614002050
45.840657648734556,4.63111714645458,1429283624001418
45.83657587830661,4.631869306794701,1429283634003624
45.83745376787962,4.6330366252654045,1429283643999329
45.743069207503936,4.774458633497948,1429284963998412
45.736683612305114,4.774818352419963,1429284974000605
45.73980986965422,4.773046187340382,1429284983995600
45.74678972906825,4.768664989885653,1429284993995094
45.737139518627856,4.768287749418986,1429285004003328
45.73936659345924,4.76781365278129,1429285013998820
45.73948305444826,4.763792694210053,1429285024003653
45.73678957542081,4.772019172540699,1429285033997853
45.737002963122066,4.770517532112931,1429285046004090
45.72691299769798,4.774184726407346,1429285056000095
45.73431265298049,4.780543626423355,1429285065994542
45.734826965265256,4.777786891724724,1429285075997356
45.73744183689683,4.786208441923959,1429285085998305
45.73766366525475,4.768147876527104,1429285096003367
45.739424818287,4.773101516093216,1429285106000461
45.73388811525875,4.773790391856623,1429285116001582
45.73774087042082,4.771445644811924,1429285126000203
45.73317343625925,4.762276717504781,1429285135996212
45.737054159265966,4.767217738819482,1429285146002037
45.7376172944075,4.773393515865592,1429285156007736
45.73776136845967,4.772887763115047,1429285165999202
45.7339055819175,4.774060144431778,1429285176002570
45.73006093083728,4.769844493878267,1429285185999068
45.73338487887643,4.772952275232227,1429285195996961
45.730818765280766,4.771111397687261,1429285205998561
45.73228902526217,4.772519389828584,1429285216002148
45.731078007993084,4.771342127422662,1429285225994713
45.72660667422049,4.775647892920477,1429285235995830
45.73282452637742,4.771311254064333,1429285246006859
45.734904026226815,4.774906719708776,1429285256000027
45.730919868575555,4.769973847389319,1429285265997650
45.731181506476595,4.767117530281116,1429285275997911
45.726782707964624,4.772070851290914,1429285286007390
45.72631147513683,4.770999826622,1429285296004091
45.73297391558583,4.776227593641287,1429285305995968
45.730240882308884,4.771171735665502,1429285315997384
45.73711782609089,4.772541810831579,1429285326000707
45.728504555508664,4.7698890146626125,1429285335996398
45.7310504035039,4.776545992957774,1429285346000507
45.728823149984336,4.7722904009905,1429285356002695
45.73046303671785,4.768510404527756,1429285365999392
45.73632856761963,4.775005661064331,1429285375999671
45.73564945874621,4.778538480248793,1429285385999048
45.73400053756914,4.764414247521911,1429285396001118
45.74320583167689,4.764520482901878,1429285406003442
45.730493874753826,4.7762889914464175,1429285415998417
45.73117836601076,4.768062586355125,1429285426006220
45.73752568159169,4.778732597806035,1429285436001721
45.7288096508418,4.772940769294002,1429285445998751
45.732839495725806,4.768184842738159,1429294704005427
45.7264593489237,4.769628781538914,1429294802996440
45.72730217272282,4.774875117616333,1429294812997674
45.729443307112156,4.773906830936322,1429294824001003
45.730057222330146,4.769481175268942,1429294834002585
45.72683264517645,4.776064896161884,1429294843999428
45.72348762463851,4.778428654568573,1429294854000864
45.71703000940526,4.778135380369362,1429294864000665
45.72538361427841,4.78622850729418,1429294873997234
45.72690212157518,4.784550446425306,1429294883998701
45.719875857620686,4.7931661326908355,1429294894003526
45.72455669209415,4.789677364622295,1429294904001586
45.729369497631374,4.784238772780375,1429294914005095
45.72109107087425,4.7862942339658705,1429294923998951
45.72451679524626,4.795203400695874,1429294933994943
45.721992884982114,4.793463274357124,1429294943993410
45.71750809288109,4.794588659706532,1429294954003644
45.72308178710471,4.7925080007036795,1429294963997379
45.726956034417896,4.793963973833459,1429294974004132
45.72177438761078,4.800195924726587,1429294983996126
45.71711608865312,4.797666929909593,1429294993993541
45.72035326517885,4.797489096546495,1429295003998811
45.72097273229367,4.8099141079053105,1429295013999816
45.71835277873665,4.799620779409803,1429295024001008
45.725025129737105,4.814561123942016,1429295033999661
45.71760646415886,4.816402313068907,1429295044003135
45.71164502131321,4.810538061701902,1429295054008929
45.722371740705455,4.807271337431052,1429295064001188
45.7222665948928,4.803986118356396,1429295073994814
45.71870885412346,4.813027394194667,1429295083996317
45.703815231933675,4.802290730388685,1429295093997922
45.72068892221498,4.809277638653132,1429295103992598
45.719587383840064,4.814702903972028,1429295114006849
45.718378030679574,4.804694641182781,1429295123999180
45.72319847483141,4.810587560307959,1429295133991750
45.711786471078796,4.8090518549777075,1429295144001354
45.730621784445624,4.811374456640353,1429295154003142
45.72059174913419,4.823332758240591,1429295163999911
45.71827081703261,4.811962445417189,1429295174004066
45.73553440585325,4.822905818336845,1429295183997058
45.725286197159924,4.821134752582277,1429295193993138
45.724212250209845,4.825168518063567,1429295203997863
45.72599095501675,4.811301821764866,1429295214001649
45.72791816133832,4.814826947405863,1429295223997810
45.72680107283746,4.809451871115252,1429295234002347
45.73057183133984,4.810874769227598,1429295243999373
45.730141070811406,4.815785685484144,1429295254006533
45.72842441514723,4.816906960315102,1429295264002827
45.734265795734444,4.823365073133708,1429295274001386
45.736706370552405,4.81458690586836,1429295284006138
45.733601256213696,4.8099289194414245,1429295293996326
45.738563375755845,4.819201793034416,1429295304000633
45.734625311037746,4.8191619858613,1429295313998888
45.73166508990883,4.825224191653112,1429295324003365
45.73994320257552,4.826497671621266,1429295333999517
45.73456025987665,4.8217875306332525,1429295344003810
45.74436602083048,4.811295556010664,1429295354005962
45.740757476013364,4.825750565964284,1429295363994765
45.744759290739935,4.827448954189188,1429295373998325
45.7479780226323,4.828027221891804,1429295384004873
45.742469007204484,4.8316953822207465,1429295393996796
45.750792164850054,4.830601679536918,1429295403998799
45.756464678196835,4.834526410526346,1429295413997801
45.741165207029674,4.824519038693089,1429295423999563
45.7474606521989,4.838642796656083,1429295434001360
45.75204624303513,4.835105060116349,1429295443999745
45.74304837143768,4.841562283921309,1429295454000150
45.74526256853113,4.833066786760622,1429295464001340
45.74734727656201,4.844690214081912,1429295473999249
45.74363162670542,4.84004071171461,1429295483998638
45.746315670904146,4.844432226551697,1429295493991855
45.744372581970126,4.832441926261041,1429295504001598
45.74765286901957,4.838049553741787,1429295513997851
45.743356921838405,4.8394080302410805,1429295524007906
45.73690303733754,4.848267933785418,1429295535003772
45.737910195617154,4.840981452598522,1429295545003656
45.744809932537926,4.838986251040069,1429295554993706
45.74459577482194,4.842454835704156,1429295565000471
45.74804764731783,4.841187542837852,1429295575001649
45.75095506329944,4.840074577597136,1429295585002522
45.7545996392251,4.843179682936835,1429295594995341
45.753226724008734,4.840685048767805,1429295604995917
45.754368227919855,4.8536460945570585,1429295615004977
45.754544234207685,4.850910896462591,1429295625000696
45.7507938078275,4.8508973425264506,1429295634996068
45.748405879568516,4.842477373919814,1429295645000164
45.75571096651539,4.847732843696346,1429295655002343
45.744789001357496,4.848670153765323,1429295664998316
45.750924386091555,4.839209389631219,1429295676000781
45.762369954740414,4.842291023821366,1429295686004506
45.75465257198957,4.850250948221249,1429295695999415
45.752704890277826,4.841240205603508,1429295706002744
45.757764025341416,4.844122643307721,1429295715995344
45.755384037135116,4.843717075965003,1429295725999076
45.76224740604998,4.845726580393489,1429295736002154
45.76003157756489,4.853874790405426,1429295746001038
45.76018406980924,4.848948798929423,1429295756000110
45.762626750153686,4.850139376337132,1429295765998712
45.76922535544242,4.854672608212618,1429295775997624
45.76198663039638,4.84780609254746,1429295785997154
45.76850139098721,4.849183641939615,1429295795994976
45.76345301622221,4.831872234562291,1429295805994918
45.76527758513677,4.850413252218914,1429295816000375
45.76180385737432,4.833664749449243,1429295826002638
45.75530320001462,4.841622378883952,1429295835995529
45.763071604272994,4.850348477512884,1429295845998457
45.755380997498634,4.852628736048954,1429295856005216
45.75942389413552,4.846588130761008,1429295867000704
45.763063348333,4.845991674211524,1429295876999616
45.75540157618473,4.843711670501184,1429295887002864
45.76407412834813,4.849621163042782,1429295897001411
45.76149758676131,4.858467242515817,1429295906997695
45.762096097027154,4.844379518857118,1429295917000787
45.7657856157877,4.845489220996627,1429295926996149
45.77264669659539,4.842228162768345,1429295936997924
45.759336664048384,4.852945592445015,1429295946997091
45.76505779671325,4.849286759099691,1429295956996687
45.76555813610223,4.850171575135186,1429295967000399
45.76994164782572,4.84951226450029,1429295976999716
45.75699825766921,4.847991207124006,1429295986998241
45.75781930992026,4.857159952644049,1429295997000120
45.76397434957019,4.858078538057394,1429296006999043
45.765336710006785,4.857323481235331,1429296018001800
45.76406134968013,4.863314555420295,1429296029000882
45.76404714443799,4.8589807560479175,1429296038997548
45.764038124318525,4.8606643268848195,1429296048999100
45.763661113138994,4.853557170022355,1429296059002006
45.76902299820077,4.85490813808868,1429296070000970
45.77378745841211,4.858640132084388,1429296080000378
45.76991869569856,4.856918036992835,1429296090002876
45.774617202502824,4.852424647454123,1429296099996219
45.77210932640656,4.858065799208144,1429296110005808
45.76398399146428,4.853035975364132,1429296120004077
45.76719569924503,4.870245832707848,1429296130001894
45.77218778225752,4.867811580650716,1429296139993208
45.7783159523008,4.859358724378517,1429296150000718
45.768022579238995,4.856956025402344,1429296160006384
45.76626650250379,4.862586001265517,1429296169995645
45.770433621274385,4.864122639400109,1429296179994994
45.76908393373889,4.865517650024617,1429296190000076
45.76533116136516,4.863514602827446,1429296199996808
45.76278994742123,4.859027738063305,1429296210002498
45.7689115708436,4.868608173918065,1429296220000513
45.767268531497564,4.859128825843367,1429296229996037
45.77293208335868,4.858536734235159,1429296239997478
45.771406587969445,4.861243387072465,1429296250001869
45.77363116207283,4.872289409591445,1429296260002823
45.765759880124804,4.872658161074389,1429296270002699
45.77228629158623,4.865148362765504,1429296280001460
45.780427795292724,4.878427788994894,1429296289994087
45.77238045879182,4.873221310892412,1429296300001001
45.7838681241576,4.868394853449524,1429296310002007
45.77152445429881,4.8814724822965285,1429296319996639
45.77607813156511,4.87246346752213,1429296330000060
45.772169890852034,4.871322175935485,1429296339998073
45.778063672107464,4.876439490872009,1429296350002279
45.776085409946944,4.8739203779795055,1429296359994697
45.781491035312804,4.874883591930666,1429296369995831
45.77582246354442,4.880404555245147,1429296380002224
45.7738610546103,4.87748445997527,1429296389993932
45.787626363063374,4.873717877658597,1429296399997913
45.794269258436344,4.876731663321944,1429296409999867
45.782046975602704,4.876175585388603,1429296421002352
45.786131667062676,4.879255544870525,1429296431008722
45.78335423028075,4.8795980547166815,1429296440999112
45.78663969795222,4.876092738725604,1429296451002670
45.78328791898262,4.886731936863102,1429296461001403
45.79434217554714,4.886252815107974,1429296470999524
45.78221800895582,4.876761492534605,1429296480999426
45.77655003441428,4.88021603284425,1429296491002041
45.78828989984528,4.875968620775332,1429296501002961
45.79203708949838,4.871962746797875,1429296511003640
45.779800234601375,4.881891860199433,1429296521003028
45.7897487332608,4.872150479737529,1429296530995867
45.77937853234982,4.87348511646498,1429296541006001
45.78623084815277,4.875719726480008,1429296551004791
45.78146601572983,4.879892945461763,1429296561001470
45.77877376357993,4.87808862540454,1429296571002903
45.78722682577497,4.8812274069363815,1429296580998980
45.78501321061465,4.874619874200248,1429296591005171
45.78340554969459,4.881268663859096,1429296601001204
45.78321913352804,4.889156277156046,1429296611000277
45.78250123087295,4.877165207503054,1429296621004067
45.76482386001375,4.7543112011263675,1429386250001955
45.76140035973829,4.75385799892349,1429386260001802
45.77048876849163,4.751805091406686,1429386269995644
45.7592437821555,4.753337039582016,1429386279999010
45.76013493412102,4.7480624837439,1429386290000970
45.77573202543335,4.751015366047106,1429386299996669
45.762641810765096,4.742146363888852,1429386309999256
45.76629614066747,4.739387145174504,1429386319995980
45.76998155359343,4.746261545427251,1429386330004861
45.76563101998323,4.73617693327161,1429386340004386
45.76648336795097,4.737201291705093,1429386349999873
45.77099125135522,4.735666731278689,1429386360006888
45.77972544851224,4.73522635075682,1429386369999856
45.770535023217384,4.739580784504732,1429386380002918
45.77009410617879,4.741554037114339,1429386390004226
45.77789652862875,4.735384606163405,1429386400002240
45.773581504404625,4.736719025512123,1429386410000231
45.77466318548285,4.734828730726463,1429386420002141
45.7699627927853,4.734269584712231,1429386429997938
45.77467271585598,4.729265473770002,1429386439997147
45.78127636751101,4.733656837548257,1429386450000160
45.776220350296036,4.726934425359929,1429386459994949
45.77396782372829,4.725455820366035,1429386470001682
45.777729578558215,4.7225390828278195,1429386480006187
45.77811849804064,4.720556526923537,1429386490001774
45.780969574739174,4.725577474315548,1429386499999054
45.782762478533044,4.719470437258406,1429386510006408
45.78766694367091,4.7063888564322065,1429386520002730
45.7733163541245,4.722098997595473,1429386529990889
45.780564114033744,4.721592291527163,1429386539998441
45.78162014508092,4.708462327925712,1429386550004851
45.78522233563035,4.718717331584284,1429386560001001
45.79025706867112,4.707144847011927,1429386570000912
45.796539970728574,4.711789963899776,1429386580003510
45.78236082962294,4.70586093569075,1429386590003275
45.79308262462275,4.7115782312238625,1429386600000118
45.791661441763694,4.7089032188770945,1429386609999146
45.78612177972521,4.713545206238379,1429386620002975
45.79212073755787,4.704768656454619,1429386629995681
45.792504983293796,4.716016206266053,1429386639998492
45.79548132673319,4.70271894847899,1429386649997953
45.79443738971297,4.701841940655028,1429386659999355
45.78089018302386,4.696434033741089,1429386669999572
45.78737731854475,4.696940045495486,1429386680001096
45.78497925306578,4.694024942168352,1429386689996532
45.79800139243511,4.697666095183969,1429386699994660
45.79801533769231,4.696193575182786,1429386710001071
45.80032366420062,4.683441757095856,1429386719989656
45.792517325632126,4.690595548624381,1429386729996501
45.79766177763556,4.681562834187941,1429386739999553
45.80560580170335,4.686024819657402,1429386750004685
45.801798005532206,4.6753912425132285,1429386760003304
45.802992762936114,4.682790550337503,1429386770000448
45.799613729365525,4.673155084571418,1429386779999745
45.80369338887092,4.666116712253951,1429386789998327
45.80215634152433,4.673707810596601,1429386800001804
45.81056295080769,4.667494271749912,1429386810001539
45.80295378030582,4.665923461706342,1429386820002461
45.809424952820905,4.666193629564136,1429386829995497
45.80962637066039,4.663055970724282,1429386840003551
45.81766334381192,4.659307587832176,1429386850005222
45.809677133709584,4.6687740488082845,1429386859998335
45.811113151262276,4.660438655210845,1429386869995576
45.820505047725845,4.669692462024638,1429386879997206
45.812804867390334,4.663602168626993,1429386890003642
45.81264507160867,4.659924952673787,1429386900005048
45.82056953340422,4.663635758848984,1429386910005192
45.81802760214613,4.666493096241964,1429386919999297
45.829982083239095,4.667800751877697,1429386929996040
45.8213056442235,4.661591417235889,1429386940006726
45.82100638718639,4.6701653091326,1429386950000617
45.82421276206114,4.665154226719009,1429386960000218
45.82740019710744,4.668654870693479,1429386969997428
45.82711536346098,4.668589426309236,1429386979996487
45.81751378085085,4.666501601820045,1429386990001435
45.83040844326068,4.663952916876332,1429387000001863
45.828728459625076,4.673216652443243,1429387010004917
45.83351676995889,4.664855125701177,1429387019998617
45.829623435028815,4.6638808077260885,1429387030001077
45.82934474645377,4.6632967905443765,1429387039991957
45.828990677860915,4.668438091458129,1429387050000708
45.840713972720174,4.665098444280002,1429387060002593
45.83807976149941,4.651513165087694,1429387069999545
45.83661339129247,4.654812497390216,1429387080005022
45.84343658437043,4.650145948665176,1429387090000481
45.85069060867595,4.6609871562045395,1429387100004840
45.83915032052076,4.65783616001564,1429387109999246
45.844535384138524,4.655793204697597,1429387119995718
45.84661422489393,4.638967658309553,1429387130001989
45.83959827251012,4.645070987074293,1429387156000026
45.84954407336439,4.645483434449797,1429387165997143
45.84153871804658,4.636487257566078,1429387176001844
45.844061790391066,4.6442142748743365,1429387185994381
45.83717246672607,4.638274154794931,1429387195992737
45.8425656931568,4.631261231571906,1429387206008173
45.846780358268695,4.634566391046811,1429387215998587
45.838149326499654,4.626051246403852,1429387226001326
45.83508160257631,4.635283252098585,1429387236000345
45.8288701847438,4.621586312491713,1429387245998768
45.83822845602557,4.630306489429663,1429387256004459
45.832808542578775,4.625460255319059,1429387266003405
45.841246769969366,4.62318905310579,1429387276000946
45.839820785266674,4.617437025396312,1429387286002464
45.84487236455022,4.614789657806145,1429387295999009
45.83570510578358,4.621865717961069,1429387305999215
45.83983297236075,4.611707608849456,1429387316003708
45.835018475998126,4.609629373585142,1429387325999522
45.841483921024135,4.607271697281116,1429387336005180
45.84589774604564,4.6113031971207965,1429387345998217
45.8359843697614,4.606743394142018,1429387356005098
45.84485182726104,4.597464492393587,1429387366000041
45.840908850418295,4.597780032127624,1429387376000895
45.83909644736117,4.602076982026734,1429387385995954
45.834969700647896,4.595181363624214,1429387396001612
45.83305063673475,4.58304172233971,1429387406000146
45.83436425129886,4.5934300971826385,1429387415993913
45.84443556196998,4.590085207404393,1429387425997967
45.8440688817572,4.5836093267397295,1429387435997518
45.83664938303772,4.587284330148311,1429387445997464
45.83785906840476,4.5872681720299155,1429387456004944
45.83777365144405,4.583348018549109,1429387465997582
45.833380068079705,4.576286023108016,1429387475997926
45.844118563679444,4.580440662139368,1429387485998943
45.85013116873122,4.5818658400825765,1429387495999719
45.83975268449838,4.578592207528562,1429387505999458
45.85228900323509,4.581558920987233,1429387515998285
45.85451983308254,4.5874751734740284,1429387525995744
45.84859443555273,4.5815562837827875,1429387535994489
45.85130733397179,4.579162727865008,1429387546001787
45.85988883435601,4.582260323572251,1429387556006740
45.86414482721931,4.574021727555032,1429387565995411
45.860181252945765,4.57835269196408,1429387576003392
45.85011371512145,4.564611871721913,1429387585990664
45.855998944693425,4.557897232994796,1429387596007236
45.85944566774419,4.566626240236934,1429387606001580
45.86356924715576,4.553412375773541,1429387616000328
45.859936083915535,4.5621873975237435,1429387626001433
45.85424659708886,4.5516443708563825,1429387635996542
45.86596749026178,4.556074219284308,1429387646002737
45.86749053320946,4.550213791496118,1429387656000708
45.86218042464982,4.557543931197049,1429387665999027
45.865418606879196,4.551641704702202,1429387675995941
45.87159399794931,4.544410881888688,1429387686001048
45.869261424378145,4.53430879343699,1429387695994394
45.87541785243525,4.540487616875836,1429387705999609
45.87106313989364,4.530109704779455,1429387716001577
45.8663609923165,4.537778949138724,1429387726004803
45.87279087280565,4.5344300454546485,1429387736002818
45.8697957755124,4.535530581981887,1429387745998779
45.88413318143479,4.530289611794209,1429387755993714
45.87569120812956,4.5380945836131605,1429387765990665
45.876030462345554,4.526484535451864,1429387775999276
45.86982261697136,4.52959628388393,1429387785998546
45.879715178477014,4.530651056244399,1429387795998789
45.87526777442912,4.518262275971076,1429387806001316
45.88177200093685,4.5259616370660805,1429387815999301
45.876904915636146,4.5240282707247275,1429387825993465
45.87546179483765,4.508018698681388,1429387836001429
45.875778662123835,4.52218348278815,1429387846006390
45.88077636093817,4.524111981762961,1429387856005257
45.875962251797354,4.512147063704056,1429387866000831
45.87334783297099,4.515482795738253,1429387875998873
45.87219846473815,4.511432462263503,1429387885996114
45.88014808887128,4.505929069514823,1429387895997197
45.86790614504272,4.506178286386861,1429387905998874
45.87646905476996,4.504568036002293,1429387915998475
45.86637078786469,4.495660351085147,1429387925999584
45.87519283181102,4.5021288797612415,1429387936005791
45.86780748528287,4.498376370810122,1429387946004144
45.87080356050401,4.496042317389702,1429387955996719
45.877757186863846,4.481924753646746,1429387965997042
45.86671752957139,4.490982524019698,1429387975997155
45.87461901633487,4.4814083584691415,1429387986001857
45.8725877838825,4.483465423650092,1429387995989307
45.87506673129993,4.48104260286745,1429388006002016
45.86960860261945,4.480437419495495,1429388016004806
45.88194233273617,4.469490047881086,1429388026002497
45.8797773639179,4.4775404878052845,1429388035994268
45.87673830257,4.471401647010597,1429388046006232
45.884021821010556,4.465574457749853,1429388055998664
45.880251038514395,4.4781522765153525,1429388065998073
45.88365913617427,4.466951771381081,1429388075999813
45.88450344762987,4.455508397953928,1429388085999574
45.89412032828647,4.460584122665743,1429388095996153
45.88495298530475,4.452592772525505,1429388106001401
45.89210836489172,4.459386555884195,1429388115996752
45.894826831132846,4.45055526560167,1429388125998018
45.88378531785764,4.445547225568188,1429388136004630
45.89549851324188,4.453116915070357,1429388146001840
45.89142140195966,4.443725827747703,1429388156003312
45.89022784961698,4.4447127486725515,1429388166001824
45.88847962147534,4.445231060615852,1429388176003196
45.891888713582475,4.440546764310228,1429388186000586
45.89153078950151,4.443463425313573,1429388195998811
45.895464268895566,4.442081073265532,1429388206003166
45.897900671754456,4.439862878173501,1429388215990898
45.89398904059487,4.436577081962778,1429388226001908
45.90383556813712,4.428636951069983,1429388236000922
45.88444633119388,4.429038452158612,1429388246003251
45.90456388016764,4.426990241265231,1429388255999286
45.90027674390402,4.434781449267998,1429388266002550
45.88530353786151,4.431846064476453,1429388275996932
45.89470363398058,4.427026026547373,1429388286003206
45.89862011968086,4.432402954105002,1429388296001414
45.891665180470206,4.435383400494656,1429388306002995
45.89369150329093,4.4166551547532285,1429388315998307
45.899150875440945,4.422292995894891,1429388326006570
45.89164677142756,4.42340770014174,1429388336004730
45.89123981823022,4.425453502246884,1429388345997496
45.88561483492493,4.417133484676194,1429388356005148
45.89646234105788,4.414840172605296,1429388365995362
45.89374246118339,4.4131111850093,1429388375998396
45.88515846249716,4.410800961435564,1429388385998148
45.892477526756636,4.402681120676233,1429388396001779
45.88395110184044,4.406873896914447,1429388405999723
45.88757005694809,4.400569135783297,1429388416001815
45.8945220840892,4.396947140748512,1429388426004224
45.89274733080711,4.392583824618073,1429388436000069
45.89099651250156,4.390914461131336,1429388445999726
45.899039062346,4.401501585147911,1429388455997053
45.9008796702896,4.394971286124082,1429388465993615
45.89651473214323,4.388597620415438,1429388476000339
45.89720269752566,4.386179760001212,1429388485999625
45.893961812729,4.3881679388419945,1429388496002237
