45.77854305071389,4.873142003378992,1428084152999589
45.79254229664209,4.877499170427602,1428084163000332
45.78256491512554,4.872047853416875,1428084173001352
45.7857509753828,4.870203600645472,1428084182994490
45.7868198848257,4.8762352692584745,1428084193001267
45.78159289209121,4.8748570747931375,1428084202997556
45.78751385772775,4.868721340169023,1428084213005413
45.78451250596011,4.877271762577246,1428084222999456
45.78363758592348,4.87109998511654,1428084233002990
45.76840704238491,4.872370029585112,1428084242994299
45.77954027916727,4.871392398771383,1428084252998964
45.781526427692675,4.870474706656246,1428084263007654
45.782737379750316,4.87338794745232,1428084273002143
45.78493450742542,4.864193441992565,1428084283002219
45.77545774206828,4.880356141979233,1428084292995059
45.784312414772266,4.873270289063744,1428084302998469
45.772483816365174,4.864825403897586,1428084313005617
45.7836505660334,4.864640400006992,1428084323000720
45.78266367997176,4.870933953667929,1428084333004422
45.780197468988085,4.868649046694959,1428084342994598
45.777522204719915,4.8722660032812,1428084353005880
45.78553581288338,4.869360126107877,1428084362999071
45.78361584219147,4.871643794255244,1428084373002307
45.77393433971578,4.870183265947071,1428084383002337
45.787278925134515,4.8657695695738905,1428084392998946
45.781789888902175,4.8726860155656215,1428084402991390
45.77698787687274,4.877324689071122,1428084412999656
45.7794676208965,4.8720130721665225,1428084422999934
45.78379557311437,4.867533361228693,1428084432994789
45.778571054317595,4.863391273212622,1428084443005930
45.78183191880691,4.871546284525309,1428084452996165
45.77908035837364,4.866374388192602,1428084462992409
45.779845203056446,4.866845942889314,1428084472997321
45.78107039789342,4.876318334742675,1428084483005405
45.77906224193229,4.876286913150426,1428084492996878
45.778908241399684,4.863988007591016,1428084503000731
45.78740048210365,4.866050539652896,1428084513001908
45.78233339544205,4.879849848881308,1428084523004965
45.77957563498185,4.870494472558249,1428084533003191
45.781060594293685,4.873952623013732,1428084543002284
45.77515300164081,4.866635424576317,1428084553000777
45.78799455058778,4.866464330557193,1428084562998368
45.78668352848778,4.869193012887621,1428084573001651
45.78135910612476,4.868011212663097,1428084582993854
45.78340211817069,4.866935539624587,1428084592998751
45.78578546275934,4.874946324593363,1428084602997632
45.77683159376902,4.877379417658446,1428084613006590
45.77374626622984,4.868147999207624,1428084622997258
45.786619036987986,4.864993324715012,1428084632996382
45.77241267442025,4.8810119718785865,1428084642999441
45.77971119648171,4.874396782855657,1428084653002398
45.78346111507195,4.879436702675169,1428084662994688
45.78251142766032,4.871130131162164,1428084673001451
45.780724744802875,4.872976186254523,1428084682999862
45.78032703024645,4.8716976756809665,1428084693000460
45.788443454485595,4.880470472918974,1428084703000120
45.79282543679124,4.8702488663599794,1428084712997043
45.781367930931964,4.878708629882953,1428084722991732
45.7790896838599,4.868930867724318,1428084733003747
45.77365113531115,4.872117171543668,1428084742995394
45.78312805201963,4.877464108786365,1428084753000445
45.786156271476635,4.87956139728926,1428084762995124
45.776493548121536,4.870679931933991,1428084773005330
45.783247936434385,4.873726598899462,1428084782999532
45.777885518726805,4.8706750147209465,1428084793000505
45.7844853486402,4.867550950208215,1428084802997418
45.7877480865071,4.87585963267729,1428084812994787
45.783948547373136,4.865710782194584,1428084823004019
45.78475933736465,4.866055404337586,1428084833003785
45.7698554130484,4.867400441745673,1428084842999750
45.7851035195818,4.86619430097453,1428084852997876
45.776867287427656,4.8645520403872995,1428084863001535
45.79216895775593,4.862809867612919,1428084872994258
45.78334597902327,4.863173665968477,1428084882996494
45.779806598009536,4.85900231527591,1428084893004580
45.78322246917551,4.865901299201512,1428084902992598
45.78234218568011,4.866820645460491,1428084912998876
45.77553224015649,4.862826094621818,1428084922999081
45.778117485344914,4.857184333975469,1428084933003887
45.77976475790111,4.865077450666677,1428084943003880
45.771236848213746,4.865903091861804,1428084953000829
45.77490149605562,4.866315887879657,1428084962998522
45.77146982858514,4.868755746225611,1428084973000887
45.770457687805376,4.858459340327289,1428084982999377
45.77497904380857,4.87112359044236,1428084992993591
45.7742009525483,4.8705387320334195,1428085003002778
45.776438769010355,4.86455008279559,1428085012997550
45.774543434692944,4.874470498426418,1428085023001312
45.76757699812924,4.861926175735584,1428085032995780
45.77181586456417,4.868712592395482,1428085043008133
45.76626825736478,4.856065312568532,1428085052995590
45.77175648476318,4.86697552979752,1428085062996826
45.76788988914371,4.860043436226535,1428085072999698
45.76659731119857,4.871737966371436,1428085082995629
45.77505339924946,4.863672005544331,1428085092998818
45.76292238457663,4.860599874357471,1428085103002513
45.773669437867845,4.872296330635859,1428085112997846
45.76714592760777,4.860861136107421,1428085122997001
45.77310413764709,4.858747611580487,1428085133002233
45.76685643250323,4.858623869538537,1428085143002885
45.76572041700299,4.858819582149665,1428085153001035
45.7754019832261,4.8676701650594785,1428085162997183
45.77123764150652,4.860481064695165,1428085172997357
45.77364710286692,4.869415917564455,1428085182996795
45.774378877558696,4.852984165354005,1428085192994802
45.76679181638499,4.859755729933137,1428085202998242
45.76612602319268,4.857833842232469,1428085212996881
45.77577387521267,4.863541805415361,1428085223004137
45.77095409022726,4.866018026589463,1428085232999617
45.77333367050273,4.870263095922137,1428085243003828
45.77303038676793,4.868578606671961,1428085252994175
45.772811108307785,4.8614904364825815,1428085262998879
45.771237370175065,4.862600944984466,1428085272997741
45.76931733701911,4.8635752670046,1428085283002729
45.77593158486693,4.861865020008714,1428085292996757
45.76969044491198,4.866415631598238,1428085302998761
45.76807391652954,4.874272047577774,1428085606994587
45.76721127109169,4.879077551018738,1428085617003313
45.76579831632543,4.874753504761073,1428085627000156
45.77205984769317,4.889165370763614,1428085636999353
45.762064664163475,4.879285558074955,1428085646999653
45.77188739563989,4.882588693542455,1428085657000081
45.77135884928843,4.881143695379116,1428085666998900
45.76721843479332,4.876573696500313,1428085677006232
45.77697276015799,4.87203958875069,1428085687004934
45.76306184267055,4.880084979704295,1428085697000606
45.76732687292725,4.88704592849082,1428085706992728
45.765122687972024,4.8812243109527556,1428085717003869
45.777196888859095,4.880576270465556,1428085727000090
45.76772927064361,4.869442152480807,1428085736996919
45.770061602441,4.880895753022244,1428085747001269
45.77955489700746,4.880332301678148,1428085757005883
45.76398451310374,4.882830572957647,1428085766996369
45.77736407614942,4.881684681357461,1428085777001170
45.763789730452665,4.883977398243189,1428085786997309
45.77492817792066,4.879229587934092,1428086866999779
45.770623284760184,4.8806115685507505,1428086876991498
45.76305665129676,4.880824171858954,1428086887003759
45.76107137249476,4.880770218624548,1428086897002140
45.77003576314549,4.8779716249213365,1428086907000445
45.7742197033045,4.884145075622316,1428086917003027
45.76291287394287,4.877223763186593,1428086927000299
45.77124573107952,4.877231132266316,1428086936996276
45.767123218049825,4.873861881254595,1428086946998762
45.76813468933137,4.881778812145329,1428086957002493
45.763510726978204,4.884838448993224,1428086967001891
45.770628056872674,4.881486849765566,1428086976995422
45.765032880865085,4.880821770367016,1428086986998580
45.77074724327466,4.877633804570009,1428086996998118
45.76789999317431,4.88189343500171,1428087007002929
45.77242297962203,4.880416717960753,1428087017001326
45.76298444548657,4.875314573774304,1428087027003260
45.76436814885063,4.878774691394678,1428087036997563
45.7600667987007,4.878849654955702,1428087046997124
45.757673512185704,4.885738833525798,1428087057002124
45.76777621309464,4.8848941389439995,1428087067005080
45.76486403017956,4.880166482094396,1428087076999619
45.76631678664,4.87468036268266,1428087087000138
45.76741460080345,4.887925458393255,1428087097001902
45.76588348404883,4.882882356144048,1428087106996661
45.76498982342714,4.881539363299779,1428087116997606
45.771205175741564,4.883498736042728,1428087127000572
45.75888180072579,4.873313055434363,1428087137002610
45.76454813068319,4.882996109738957,1428087146998566
45.75835122193905,4.8820008412327685,1428087156998379
45.77035667499794,4.882516886298876,1428087166996835
45.76737030602218,4.876545959760076,1428087176995033
45.765798848813475,4.882920533618727,1428087186999532
45.75778688565938,4.87525154873157,1428087196995938
45.76341439161671,4.876941703346958,1428087207000346
45.76531341023118,4.885651451363269,1428087217007154
45.760512101507096,4.884212707086011,1428087227000390
45.76395896265007,4.873961532790859,1428087236997240
45.76435264287017,4.885287213190141,1428087246996496
45.763442393987994,4.872566067508821,1428087256994971
45.756350787150915,4.88449640425071,1428087267001962
45.76554404863969,4.881233325628432,1428087277005335
45.767894595198314,4.877464198575205,1428087286992870
45.75756290434479,4.876741401073151,1428087297004987
45.76060495383501,4.878474722809261,1428087306998673
45.75980736886987,4.879743076353233,1428087316999672
45.76786273733117,4.875600469713694,1428087326998218
45.76127527663816,4.8806472600929185,1428087337008406
45.762346065084664,4.8707264823790055,1428087346999876
45.76622096854052,4.878419494907323,1428087357001169
45.76994309696143,4.879863906593987,1428087366997282
45.76147099930759,4.87334938804868,1428087377005865
45.76602301716695,4.880029991801867,1428087387001598
45.77074735648748,4.878998112637239,1428087397001514
45.76007311245997,4.8867246017376225,1428087407000499
45.77086507288314,4.875604468714136,1428087416998634
45.76041806073505,4.878898106557962,1428087427000145
45.77148570459869,4.883922668306403,1428087437000359
45.76360558671429,4.876245926755905,1428087446997285
45.76940700568462,4.876057784745804,1428087456999220
45.750142133583616,4.87859581267335,1428087466999898
45.761483756043994,4.871378695632198,1428087477002134
45.75847429041589,4.884169256688364,1428087487001210
45.75985654299186,4.885153308729797,1428087496999670
45.77015279252315,4.879748695579778,1428087506999157
45.7687450866763,4.875501463261891,1428087516998083
45.761540935915434,4.881515274975797,1428087526999059
45.76870314940073,4.8745062584912695,1428087536992007
45.756358850808176,4.879928234262078,1428087546997817
45.76608355671959,4.888444254507721,1428087557000144
45.76564248121968,4.886429758771637,1428087566999737
45.765881954933846,4.884649201503561,1428087671004599
45.76664566125731,4.8784109160448095,1428087680993706
45.770687086962056,4.875508061639768,1428087691003481
45.76158953952321,4.888736998210072,1428087701002642
45.765511133050005,4.879501620881748,1428087711004450
45.75405354115105,4.879715317319996,1428087769001880
45.759463899542666,4.878902442240399,1428087779001291
45.769377986056334,4.885901945075884,1428087788990925
45.75481559244834,4.8823642981530755,1428087798997635
45.75926848722937,4.877969032812147,1428087809001861
45.76162019818717,4.881943152476408,1428087879003839
45.75787061924366,4.882456504658727,1428087888995764
45.76088061934265,4.879834856925089,1428087899005110
45.763486991524616,4.87405093002278,1428087926005898
45.76432645079988,4.879727698260769,1428087935992880
45.76422348211548,4.887470441547462,1428087946002314
45.75664514392359,4.8812481512265915,1428087955999445
45.76105952475671,4.877300076995508,1428087966000357
45.7616075434175,4.884701340866217,1428087976002040
45.77003627010194,4.882560893568887,1428087986003435
45.75735978153326,4.882677668921955,1428087996005752
45.770307747791456,4.8832048858064905,1428088005998603
45.75913233382669,4.889103569977131,1428088015999231
45.767021433680355,4.87594580015557,1428088025992654
45.760999063837,4.873676219956116,1428088036000899
45.761489591820045,4.883951534031329,1428088045992175
45.76852633077769,4.883367642859257,1428088055992220
45.75787932302952,4.873799653285591,1428088065997256
45.77051959584201,4.887826418627189,1428088076000121
45.75960378723866,4.882806902970143,1428088085999425
45.75997392085804,4.8866204333823955,1428088096000313
45.761474885472516,4.879948485391161,1428088105999086
45.7613008645933,4.88091780787647,1428088116001727
45.77312491711096,4.8845173528169585,1428088125999337
45.758482300546454,4.877269918494284,1428088135996564
45.76553610132816,4.881167558309327,1428088146000951
45.76110635139988,4.877162797962256,1428088156002638
45.75773026008461,4.879031133823073,1428088166000827
45.761735125980536,4.884118055866868,1428088175999076
45.757490497202475,4.879322526119412,1428088185995065
45.76558346140254,4.8872548046504525,1428088196000951
45.76236914123689,4.87796846241911,1428088206000011
45.76961228137701,4.878844077744578,1428088216000058
45.76405472329933,4.877027314878889,1428088225997354
45.776514132294295,4.880988182811979,1428088236002921
45.771987276865595,4.876851836859772,1428088245989159
45.76494405347694,4.882378974914543,1428088255989931
45.75918653954069,4.881790123739531,1428088266000152
45.75884430344045,4.879809412577056,1428088276000335
45.75266928398654,4.881369351279572,1428088286002985
45.76632830427454,4.885588898260926,1428088296001223
45.75393532892933,4.874687103680177,1428088306002412
45.76865687414471,4.882573532725071,1428088315996891
45.761481886617425,4.874364054346221,1428088325999011
45.76467092529208,4.875865165061113,1428088335999095
45.760958951134754,4.874622480598365,1428088345995790
45.75793805258456,4.878237813225936,1428088356003836
45.756258207866026,4.883031308229736,1428088366001472
45.769644566571614,4.873158886392273,1428088376001025
45.75833159078283,4.883343970824089,1428088385994981
45.765479345822705,4.878277879415545,1428088396000830
45.76353840208762,4.88214110738637,1428088405994560
45.76650120797663,4.87161904011161,1428088416000489
45.76454748498313,4.883908781623718,1428088425998180
45.76381571139044,4.875191308231696,1428088435997574
45.76137080421018,4.883811543863356,1428088445998158
45.76098943574385,4.885053193027765,1428088455999253
45.763262096273486,4.87231576672549,1428088465999679
45.761056445674086,4.888201206627523,1428088475998953
45.76546405182307,4.876332079718392,1428088486000005
45.76765640558372,4.883368913075647,1428088495997348
45.76392719891065,4.877502362965736,1428088505993725
45.76176041315565,4.872241848635909,1428088515998479
45.758190970533796,4.875733456213021,1428088525998036
45.759691485409185,4.883599282251426,1428088535999038
45.762726076071885,4.882210689754848,1428088545998660
45.75670754330813,4.883264318600489,1428088556003075
45.75551587124399,4.885141034903114,1428088565997114
45.762254827112514,4.878172041526012,1428088575997255
45.75794567234938,4.885145120474536,1428088585998100
45.76449645227106,4.873103947636872,1428088595999326
45.76271087459674,4.885690965342025,1428088605999182
45.75772419617905,4.880848330019408,1428088615997635
45.76136402913105,4.878932306876244,1428088626001066
45.756243805191744,4.873929110415061,1428088636006831
45.76658221251632,4.882906268011138,1428088645998100
45.76421315372701,4.880215362059482,1428088655997560
45.76425592194077,4.8813765561408164,1428088666009598
45.762372067745325,4.87974169944206,1428088676001503
45.761525953214374,4.872159733590265,1428088686000743
45.757619734449,4.877223211392404,1428088696005142
45.75985578855192,4.882557011179181,1428088706001177
45.76279419110678,4.876389352953266,1428088715994756
45.766723798075375,4.87771155017642,1428088726000556
45.75883691847319,4.873171273968693,1428088735999317
45.76250583174793,4.876262288535935,1428088745999891
45.76425179330672,4.875034853113001,1428088755999031
45.758182955193426,4.885682386490565,1428088765999324
45.752546597621155,4.882080441478525,1428088775999765
45.75894950189098,4.88441391541941,1428088785995485
45.76031738254573,4.883709712809127,1428088796003787
45.76091360555821,4.880239957567581,1428088805993988
45.75887122662518,4.884439030128019,1428088815995868
45.77215612464798,4.882886032552491,1428088826005117
45.7632474726457,4.8764116476241695,1428088836005569
45.755034439133624,4.887993069100622,1428088846001345
45.76393525952232,4.883837182309218,1428088855999879
45.76157350381584,4.884103431124592,1428088866000095
45.74976649670215,4.879387348353782,1428088875996844
45.75476160133339,4.8787942050376465,1428088886003748
45.758403387650894,4.877155005752236,1428088896003515
45.76908892362696,4.887267745193231,1428088905997849
45.754611211873865,4.8775566057222886,1428088915997400
45.77183810690048,4.875795879478998,1428088925998501
45.756787553203345,4.879348165976929,1428088935993846
45.7608844410671,4.872822323095672,1428088945997529
45.757571987205836,4.877907655791962,1428088956000506
45.7594193151048,4.881820000312394,1428088966004465
45.76524744337569,4.879605820851437,1428088975997752
45.760658071947034,4.883419752714373,1428088985995647
45.7733583602867,4.886201622346421,1428088996002191
45.76728887859994,4.874780650502281,1428089006001879
45.76831079774878,4.882287109652052,1428089016006206
45.7579210695047,4.881332904015964,1428089026000409
45.770179294279494,4.8808434274492125,1428089035997846
45.76708878885841,4.880426088601669,1428089046005607
45.759862766690425,4.88434164645562,1428089056003272
45.75955029067536,4.8773664000808,1428089066000549
45.76613226795891,4.8818441290149295,1428089075999778
45.75517439737879,4.884158204588701,1428089085998347
45.761620667985824,4.87779903718066,1428089095997617
45.75850718054306,4.887025792016865,1428089106002283
45.76135028838254,4.885183018043744,1428089115998056
45.76501585328719,4.876307274618943,1428089125998134
45.763813811450696,4.872290756109123,1428089136004075
45.74876141399519,4.883425735276756,1428089145999504
45.762289757817896,4.877440613845699,1428089155997043
45.76549092460035,4.882678060491417,1428089165996585
45.76291236517375,4.886332656199375,1428089175995442
45.763280738374874,4.866076414047062,1428089186002005
45.76398970550973,4.8816974886186895,1428089196009390
45.76178686565938,4.883248915441283,1428089206007095
45.74781527778313,4.879457147848874,1428089216003142
45.75757615315188,4.885371628925338,1428089225995338
45.75967917417668,4.882051856524955,1428089235997542
45.76347988155404,4.887386323645962,1428089245998209
45.761851363218156,4.882350185304254,1428089255995591
45.75856025400696,4.874544415478659,1428089265994262
45.75847951478594,4.885643101445066,1428089275998417
45.76212733374828,4.877793549609566,1428089285995743
45.76402859053788,4.878888968007523,1428089295998482
45.760029844945706,4.87851341599219,1428089305995914
45.76131963331856,4.877542946242712,1428089316005953
45.768181263018526,4.878004211322245,1428089326005436
45.761543608872344,4.883809240670268,1428089335999037
45.76356017108428,4.880741423857937,1428089346001343
45.762361452156455,4.879122417381798,1428089355995943
45.75648318584433,4.871622058903938,1428089366001873
45.76223015306805,4.878648471584918,1428089376004719
45.76462640128948,4.874932800708826,1428089385997271
45.76180134250553,4.885888983075852,1428089396000805
45.76215957009662,4.884606167526235,1428089406002055
45.7684910873205,4.8765428139126765,1428089416005217
45.763895649483615,4.862991739499487,1428089425997058
45.76594944747599,4.884507629835103,1428089435996441
45.760835117139656,4.882297592473909,1428089445996704
45.76353362529583,4.8783231510962795,1428089455997665
45.7621012186513,4.88083592736956,1428089465997517
45.7583811577945,4.879535692290702,1428089476000125
45.76484183003571,4.883546007725065,1428089485996880
45.760833581545114,4.877955262440329,1428089496001083
45.762527051939536,4.881229420227787,1428089506005982
45.76706664373829,4.882559858121038,1428089515997079
45.76026329953329,4.882777327910495,1428089526004145
45.763534250017294,4.879705344537349,1428089536003726
45.75986182655473,4.88629245562913,1428089546001654
45.76206575391204,4.878038841934505,1428089556008729
45.76402047609879,4.880577622860937,1428089565993273
45.75871490670525,4.884186916336774,1428089575998931
45.767979597217156,4.876787449134757,1428089586003243
45.76362311053549,4.883573970297933,1428089596000392
45.764592987730815,4.884828614238511,1428089609995804
45.76544665593894,4.8718901256758675,1428089620002904
45.763397384766435,4.878682062034079,1428089630002139
45.755808445111796,4.885562411245713,1428089639998733
45.75486226442236,4.877012337578307,1428089649999395
45.7583534814982,4.870692103959989,1428089660001368
45.76765260526993,4.883212446069593,1428089671003402
45.75714679666129,4.888999776927617,1428089680997921
45.758210798384326,4.8786513238988904,1428089690993737
45.769140311640506,4.8808580352535245,1428089700998784
45.76047947678661,4.879940723810131,1428089711001305
45.76720734037141,4.877773757280939,1428089720999590
45.757488475845484,4.8763690031202644,1428089731000407
45.7648958147124,4.8809375510935995,1428089740995987
45.766176388203405,4.878405775017366,1428089750994442
45.76348425967025,4.882111536674289,1428089761007363
45.76910798389904,4.878558940310602,1428089771004719
45.756723518672544,4.890372543859142,1428089784000268
45.75938879034492,4.887858207811623,1428089794000343
45.76534213150623,4.888713367099154,1428089803994118
45.764135521691806,4.876918855655422,1428089814002863
45.765756654526356,4.887675287657666,1428089824000416
45.757573935871484,4.874332516232733,1428089834001390
45.757927382317995,4.880505162251005,1428089843999762
45.76262944919722,4.875281507676762,1428089853999284
45.76381897937343,4.886657833590328,1428089864009695
45.758105763724465,4.8746052453484765,1428089873996342
45.75405194993477,4.885069736269436,1428089884005167
45.76505717622282,4.881784306826181,1428089893996768
45.767242745477965,4.885118588267575,1428089904005140
45.772781109574446,4.887926962432066,1428089913998578
45.764448297359145,4.8838373862205335,1428089923998250
45.75708374587458,4.880402106488799,1428089934004094
45.75892266238642,4.874079256891426,1428089944000724
45.759892918434865,4.883849336177202,1428089958001316
45.76527530732109,4.877148790756256,1428089994993045
45.75906673414229,4.877475016533025,1428090007996155
45.76170455185603,4.874213423179898,1428090017998716
45.775219569304085,4.88405295550028,1428090028002668
45.75475569904992,4.88065591450811,1428090037994928
45.762566441007834,4.87317757117402,1428090048992678
45.762056545042576,4.8754424984026095,1428090059000338
45.75614687464461,4.8808966113429815,1428090068998347
45.76159138665958,4.887325771978815,1428090078999589
45.75907485986907,4.88072812639676,1428090089000718
45.76330836879558,4.893021241062699,1428090098996408
45.767209020085104,4.890102965315736,1428090108998514
45.75588295967535,4.875142013690687,1428090118994105
45.75956723836873,4.885024630269433,1428090129006477
45.76915631367666,4.880528948722233,1428090138999056
45.769188855302076,4.885280020958966,1428090149004352
45.75698274879226,4.878944296526962,1428090159001116
45.76423862977273,4.879927872337388,1428090169005146
45.76232236770899,4.885105748462365,1428090179003521
45.760627551152254,4.884300121471543,1428090189002515
45.760705955242805,4.8825501332824315,1428090198998087
45.77579327437845,4.880281822560469,1428090208994363
45.76064516274957,4.881930091786298,1428090219000382
45.766702751602814,4.8780279739496235,1428090229000106
45.76502882050633,4.882936313553324,1428090238997654
45.75903963640077,4.87800223183361,1428090253992889
45.75527062121342,4.886537805999883,1428090264002159
45.76052014247207,4.873331793997947,1428090273998946
45.76312644121161,4.880516613217175,1428090290000008
45.7545997735305,4.881473122477471,1428090300001852
45.764574099118185,4.881460925827236,1428090309998811
45.76420800426221,4.882800467271452,1428090319997411
45.76058504016591,4.884282117226285,1428090329994489
45.76814427569255,4.8816175205858245,1428090340002099
45.76208373791093,4.8772732067852,1428090350001315
45.75875494074445,4.887047849780475,1428090359995861
45.762533790324696,4.879259961776595,1428090370002411
45.76266160977874,4.8832933907369345,1428090379997798
45.76025102525915,4.875308100009315,1428090389999966
45.76248714849025,4.885187928900265,1428090400005281
45.75905130895824,4.87629828019381,1428090410002648
45.75506850249376,4.877443183784986,1428090419994245
45.75579326362985,4.885370493540015,1428090430002303
45.76531174819233,4.875692960132257,1428090440005234
45.76673035833419,4.877282411109764,1428090449994208
45.76040967817482,4.882167704938244,1428090460003845
45.77029173051615,4.878969908532362,1428090470000887
45.756751714377,4.873041670326644,1428090479995356
45.76208339714949,4.882450104180013,1428090489990961
45.764045754501254,4.883466212078117,1428090499994162
45.76794145729968,4.876261059927212,1428090509997678
45.769459157635154,4.877185789045669,1428090519997141
45.76273377267236,4.876909827506032,1428090529998641
45.76647319531182,4.88005414430876,1428090540005526
45.76032020578952,4.870400739468584,1428090549999323
45.76009149597075,4.883324457741739,1428090560004586
45.7637496304592,4.879202589761465,1428090569993395
45.758869559841436,4.882217715694712,1428090580000074
45.75999748060685,4.885319159316931,1428090590000433
45.753214770455735,4.882690274244409,1428090599999166
45.76333165197045,4.884328393608861,1428090610006055
45.770578524934955,4.885220241469873,1428090619999266
45.762252372191035,4.882816014235065,1428090629996222
45.7628364735885,4.885192337443351,1428090640000409
45.755827294461994,4.8794741641533985,1428090650000272
45.75965853725246,4.873516136048703,1428090659993308
45.75940384878559,4.882553816179393,1428090670002082
45.756295977289426,4.8804353880700075,1428090679996765
45.764904752446114,4.883563951574133,1428090689997800
45.764971734288096,4.882079162664046,1428090700002705
45.76754524453043,4.88018189824602,1428090709999735
45.76630916846787,4.880887618445673,1428090720006697
45.77056630379634,4.883695253499461,1428090730003795
45.76036903258401,4.881541890681858,1428090739996694
45.76822441756704,4.879598129318278,1428091250998184
45.75677910978881,4.878759145694186,1428091260997725
45.758437885212786,4.880174407881076,1428091683999219
45.76290792011914,4.880571942947345,1428091698003847
45.76386663720747,4.872622676581356,1428091707995657
45.765387251586226,4.895839591069058,1428091771000174
45.75992018518465,4.88478105399566,1428091799000157
45.771030536680485,4.873229802064232,1428091808994701
45.766839448463585,4.87347255755828,1428091818997768
45.76100051415396,4.890862796550685,1428091829004367
45.762982725589865,4.87933271110673,1428091839001169
45.760157833846066,4.879758400781663,1428091848997319
45.75248949680525,4.874138605989136,1428091859000137
45.76332491241436,4.882998926568608,1428091869010129
45.75654566510249,4.876967981170274,1428091879001844
45.76311694955249,4.8694742980294885,1428091889001282
45.75988414834104,4.885458638345174,1428091898997966
45.7685477405827,4.8818215522356425,1428091908997527
45.75997892038195,4.879235228317791,1428091919003197
45.7524460055601,4.882665792018828,1428091929002183
45.7577042462984,4.888081441988007,1428091938997109
45.76689067998591,4.877358206562009,1428091948996768
45.75920854928877,4.880138120553484,1428091958995428
45.75571139565041,4.885501185850085,1428092469996902
45.758354045961234,4.890511505172852,1428092480001332
45.75842379976549,4.884140282255082,1428092489998164
45.76813823594706,4.886531040088297,1428092499999698
45.7594335645586,4.893306877390019,1428092509998143
45.76254198425936,4.8761068035622674,1428092530003500
45.75433258505381,4.880289674914991,1428092540004240
45.76789381484065,4.878486676645619,1428092549997870
45.76391314712805,4.879737660985842,1428092559998532
45.761914546856666,4.874057252414331,1428092569997083
45.75554391961441,4.8788535337933725,1428092580003568
45.76408532819768,4.885301956521625,1428092617002501
45.76015864077137,4.877892399544137,1428092932998853
45.76137340132775,4.88119540095843,1428092943004758
45.762319253561934,4.8730955284977595,1428092956999569
45.759179696768534,4.881219209341739,1428092967002954
45.77296846515785,4.882278763782232,1428092976997358
45.75979565806488,4.881557062830396,1428092986995485
45.753898307110795,4.875552277335789,1428092997000522
45.7688206103066,4.882373328958766,1428093101004884
45.7551753012011,4.876790122946491,1428093110999493
45.767172621411206,4.887417759425978,1428093120997280
45.762602057970746,4.881159691920503,1428093131002767
45.76118293859628,4.877908447478938,1428093140993583
45.76587307536559,4.87471486062215,1428093151003775
45.75983259874559,4.876456216167228,1428093160999135
45.75792460290965,4.884204609094171,1428093170999917
45.765367043713816,4.882788467076523,1428093180994647
45.76459742662137,4.8824190013285165,1428093190999986
45.7645322780873,4.879609544312704,1428093200998424
45.760487549505754,4.879139440749134,1428093211000890
45.76369487361741,4.877006253412572,1428093220999113
45.753800584220386,4.88357177014451,1428093231001592
45.767846583278164,4.883391411433459,1428093241004624
45.76377801719396,4.886640997853925,1428093250992646
45.76499597306422,4.886561243197653,1428093265993376
45.75918479212686,4.884960556585666,1428093276002751
45.76427453157716,4.883199198834116,1428093286998035
45.77178021371717,4.881407158835764,1428093297002458
45.75866028209307,4.877871251745373,1428093306999714
45.76240135035179,4.888915927438988,1428093316999892
45.761067264314775,4.876251561348424,1428093327005637
45.766186999112996,4.875432160743564,1428093339993180
45.75768357938226,4.87740915560738,1428093350002655
45.76795301759785,4.871980102530332,1428093360000802
45.75969944826214,4.87644939215017,1428093369994756
45.76183243829471,4.880956330696528,1428093379996335
45.76625641292049,4.8741778611434325,1428093389999311
45.75902648475382,4.891178938625809,1428093411999436
45.76015791546775,4.883410900399929,1428093422003865
45.76058649054442,4.873681035324171,1428093431999597
45.76089279128139,4.873466833787319,1428093442003395
45.76569238751974,4.886918891389578,1428093494005981
45.76184992613296,4.870685370905925,1428093503997061
45.76040875806584,4.881350936791785,1428093513997575
45.759334205131594,4.876887986517745,1428093524000799
45.760000794939955,4.874520853300168,1428093534005994
45.76234982877701,4.881174421486029,1428093544003160
45.76199741216389,4.87644236426027,1428093553995525
45.76408752029024,4.879365618141182,1428093563998583
45.76131126350771,4.872250651361999,1428093573997696
45.755213592816496,4.879659511534681,1428093583995435
45.76457410673785,4.88351053064752,1428093594004884
45.75876283964856,4.878878117632457,1428093604007417
45.75848958450879,4.887924041546021,1428093616005375
45.762995496829625,4.877754252561631,1428093625995910
45.7609258721608,4.882872750318945,1428093636004734
45.764138656765255,4.880848907484708,1428093646003690
45.76422291437753,4.8811787137158165,1428093656000234
45.76471447152952,4.8850415519981825,1428093666001942
45.76335996093925,4.881811275501484,1428093681997096
45.765103396896485,4.883332166860962,1428093693002165
45.760771046065855,4.8824197390304045,1428093703005496
45.76563466541106,4.880341293380753,1428093713001745
45.75696421305312,4.877402827462059,1428093723000370
45.75820102053812,4.880768446095396,1428093733007088
45.76840390428959,4.8766290077291785,1428093742998583
45.765913973046445,4.875115088826531,1428093752999913
45.76645073995989,4.876220044400857,1428093768998379
45.76845206590604,4.868891989957813,1428093780008409
45.762129570650366,4.880259840266796,1428093790000768
45.763657643022114,4.876779139840248,1428093799993325
45.759616926801066,4.867624264156181,1428093810001318
45.761672694546235,4.871569647118914,1428093820002723
45.76036612218594,4.888425995577304,1428093830009050
45.7641725580842,4.877193376037763,1428093905997617
45.765859120831934,4.878501467479218,1428094004998480
45.76531593894841,4.884629138709656,1428094015998733
45.7588150120974,4.880878672512957,1428094109992707
45.75651896153208,4.877239790312267,1428094119998695
45.75922531439991,4.8841257037769354,1428094129998298
45.75775362531922,4.874942723478787,1428094140000512
45.76474887796392,4.880911960544004,1428094150003712
45.75756181374946,4.880640946565132,1428094160001857
45.765334631076186,4.884466354956692,1428094170002025
45.75775359690412,4.878822659201737,1428094182000656
45.76047623625784,4.885052037583456,1428094191996164
45.765330732202784,4.869761241940386,1428094201995154
45.75624363465948,4.879367352511911,1428094212001258
45.76413102350781,4.87675055900934,1428094221997768
45.75549691537049,4.877921433241573,1428094231999380
45.759025523209374,4.880485447183815,1428094242004125
45.75561226704567,4.885191082038899,1428094251995560
45.76592118484939,4.879619909945056,1428094261996538
45.76991539600957,4.876092291601355,1428094271997160
45.74991713654171,4.880523815933962,1428094282006035
45.76194503697861,4.874308138706191,1428094291998169
45.77092621154309,4.879213583104693,1428094301997469
45.75756382538587,4.874589118555068,1428094312001333
45.7683264020118,4.888115043557701,1428094322004851
45.76302357700839,4.878217159819077,1428094331996094
45.7698466408852,4.879070767503481,1428094360999508
45.76775954859274,4.8750423505478535,1428094370995013
45.768151794114615,4.873575744249631,1428094380998803
45.7599016957924,4.8788051703910265,1428094391004489
45.76506406085562,4.878651643122179,1428094400997565
45.76869754708062,4.880226822733178,1428094410998883
45.76177843225103,4.874978229513703,1428094421004544
45.76327387495172,4.878031620051597,1428094431006188
45.758178432148625,4.883794272174009,1428094441000930
45.762853651125454,4.8859442147587435,1428094451001856
45.7592469723569,4.879965430015388,1428094460998428
45.770172047541884,4.878951598424475,1428094471006423
45.76852787893941,4.87646124431413,1428094481000651
45.76797551135193,4.880785346647128,1428094490995351
45.76984875190527,4.884180733371422,1428094501000975
45.766348896611,4.876016665985312,1428094511010271
45.74903776504978,4.877564064673361,1428094520998936
45.75547769459216,4.876515653531359,1428094530995661
45.77108564797124,4.871099509079865,1428094541003512
45.761139858293326,4.881524610917739,1428094900007813
45.755584147457554,4.877825122108674,1428094911000955
45.75990700620121,4.880851781965508,1428095025000121
45.76544910194215,4.873080949688988,1428095034999275
45.7633646599594,4.875361091244012,1428095045002137
45.76176104411725,4.883057256714304,1428095055001719
45.762683250416835,4.888654616164487,1428095064995519
45.75763739778434,4.8894663381564945,1428095075001892
45.75917203883701,4.880430026683588,1428095084999993
45.76288880405509,4.877942090986335,1428095095000981
45.764675977555136,4.878364996366227,1428095104993118
45.767701638247466,4.883618719399084,1428095115001826
45.75699164805218,4.884146864701955,1428095124997517
45.76587789134759,4.885482649319766,1428095134996567
45.769512972702486,4.8794234062808215,1428095144991030
45.763298090428044,4.874791847793943,1428095155001674
45.75784155805196,4.880355007868916,1428095165993194
45.762934990035106,4.8809203458667145,1428095175999128
45.76093916682792,4.878384301888353,1428096256003976
45.76110251185917,4.883875792851494,1428096266000653
45.76573820398748,4.879388773311073,1428096276002226
45.76445914482474,4.8792532929835,1428096285998603
45.762188334592295,4.877811539732022,1428096296001637
45.76206061580914,4.885269908882426,1428096306000440
45.75941411740156,4.877858188560896,1428096315996853
45.752315929800325,4.884830309358307,1428096325998304
45.770186728331865,4.876852668290335,1428096336002058
45.75918738088132,4.874774079981061,1428096345999036
45.76390920219078,4.874446001430401,1428096356002065
45.76275269998434,4.8781283283770245,1428096366002376
45.752810065721775,4.883573272602496,1428096375994475
45.755262720811565,4.876261560206908,1428096386007754
45.761574311450445,4.88243398371432,1428096396006305
45.76962816293837,4.872530333735922,1428096406003659
45.77060043102269,4.8774827877831575,1428096416005487
45.769437222487824,4.876284947816352,1428096426001045
45.77208107588766,4.886460736224853,1428096435997486
45.760590297730076,4.882625931966953,1428096446004153
45.76239078484235,4.88058825987682,1428096455998058
45.76370732409339,4.869293554752533,1428096465998267
45.765158885314115,4.875044675831327,1428096476003729
45.75417590206995,4.873637492284284,1428096485995220
45.76711644671329,4.881132260139319,1428096495993902
45.762691947526214,4.878627175153085,1428096508000011
45.75952448815841,4.888732346427919,1428096518004355
45.76915700665082,4.882141903782294,1428096534990433
45.75672096604792,4.875137909121653,1428096544996725
45.772280084505056,4.873080917419706,1428096555003090
45.76218052252679,4.8789454054296115,1428096565000109
45.76226786536037,4.873842065393366,1428096575004068
45.765602592360125,4.87426371184978,1428096584998982
45.770292740649744,4.883419630082553,1428096594994166
45.76766083167295,4.876492343834473,1428096605009675
45.76733789806648,4.883612924509094,1428096750003827
45.75540238062355,4.8819175216932145,1428096760003348
45.76668084207988,4.886296865552494,1428096770000115
45.75835638637176,4.88598529594334,1428096779998443
45.75698312338625,4.87888604642132,1428096790004696
45.75483929299888,4.877102035708935,1428096800000902
45.75995819914103,4.879207589067361,1428096810003823
45.75932319058045,4.880075553227646,1428096819999105
45.76386501818259,4.885700086110856,1428096829996109
45.76334594646715,4.878251859949152,1428096839999497
45.76030631525873,4.878322530106031,1428096849998665
45.76478896084462,4.886045182127771,1428096860001600
45.75789343840537,4.885563452471323,1428096869990089
45.75847354463243,4.8791687585360295,1428096879999598
45.76721504112517,4.882507042429277,1428096889999367
45.767063729926946,4.881971041485239,1428096900000559
45.75693384926029,4.881608023353257,1428096910001673
45.76102380184483,4.879368678893233,1428096920001758
45.76209862626755,4.88178201479649,1428096929996924
45.762846526971565,4.878264984558571,1428096940000042
45.76451238018536,4.88646994575959,1428096949998894
45.76684108108397,4.8808868101599225,1428096959997524
45.762304154509714,4.87687753739108,1428096969997826
45.75554399420557,4.876653120783056,1428096980003456
45.76555644119066,4.872157802883393,1428096989997218
45.764028341096726,4.881765261884616,1428097000003310
45.7614208728156,4.875367960167496,1428097010000942
45.76100438340076,4.875317275210228,1428097019997311
45.76978036683156,4.876711834934567,1428097030006761
45.763448993627,4.873954633921826,1428097040004912
45.768132543569,4.884422259834223,1428097049998826
45.74444486854422,4.8799741311733476,1428097178004344
45.76463237072154,4.870846458849126,1428097188000963
45.761242938745724,4.883913917241248,1428097198001781
45.76743789852882,4.885888783486964,1428097208002174
45.76340634687782,4.881374708314446,1428097217999948
45.76359172424061,4.880725881429766,1428097228998606
45.75841820026566,4.874422014868037,1428097239002478
45.76185386456243,4.87880751046363,1428097248995962
45.76953310307131,4.882735349820696,1428097258999541
45.752954057970875,4.88420678350968,1428097269005037
45.75527802413873,4.872221989284677,1428097279002342
45.759528063496894,4.88401310372907,1428097288999544
45.762828793134446,4.884297055749616,1428097298998494
45.76219807124872,4.878208758434684,1428097308999503
45.76700959613308,4.875994281444439,1428097318997913
45.7612282498836,4.875347126502363,1428097328999727
45.75664734604538,4.877482766656913,1428097339006089
45.76328864605713,4.885701633836389,1428097348995585
45.77222458668499,4.877704366132024,1428097359003627
45.75688879353291,4.88142797384503,1428097369000315
45.76363444315229,4.886930693915303,1428097379000462
45.76093308910229,4.880770132156032,1428097388996163
45.763988084254656,4.884960158130505,1428097398992521
45.761329712309234,4.879070383071581,1428097409005731
45.757594366734374,4.880909131369988,1428097418993767
45.76176142125799,4.885449251246602,1428097429005305
45.76582403455063,4.871136889001558,1428097438998743
45.757828389768385,4.884054201742792,1428097449001284
45.764895686521136,4.877073054073827,1428097458999798
45.766532683270285,4.878306602168452,1428097469008036
45.757522381496194,4.8790904305040925,1428097478994369
45.758189889293824,4.884905121197101,1428097489000329
45.76161880407346,4.884058591648406,1428097499003453
45.764641760244395,4.883422229208096,1428097509001043
45.76628500785029,4.884543116337021,1428097518999697
45.76174086606483,4.8758030470672225,1428097529001853
45.76693043708147,4.883260157143031,1428097538996781
45.75998892485404,4.879958274041773,1428097548998575
45.76401595037668,4.882733368542574,1428097558999395
45.76271842582875,4.878163056629146,1428097568991909
45.77159648071027,4.8844259140872,1428097578999840
45.75713162059187,4.883729642562574,1428097588998090
45.75989889452776,4.877085651850285,1428097599001478
45.7571241468885,4.879298005812291,1428097608999773
45.761205290157804,4.877114606726483,1428097618995937
45.75715027969657,4.879075997222998,1428097628996443
45.76099391388456,4.873771424748715,1428097639000811
45.76298384381734,4.889055337205212,1428097649000740
45.755888624647454,4.880154220392997,1428097658997991
45.76658235435206,4.876474851751763,1428097668998715
45.761637943397005,4.877221387110944,1428097679000478
45.76025154653139,4.880001815536828,1428097689002638
45.76833429715551,4.883601982011989,1428097699005366
45.75986751140337,4.886487350641773,1428097708998105
45.75938563642238,4.880991394124132,1428097718995306
45.76503197747666,4.872359958924755,1428097729001372
45.76733017885491,4.878547800765891,1428097739005696
45.762310955072834,4.88099214263426,1428097749002963
45.76142214283497,4.877605022656308,1428097759001345
45.758844155155565,4.879016850670967,1428097769003791
45.76712153061571,4.8779782153705975,1428097779000506
45.75774805561964,4.881320902665141,1428097788992431
45.75424892722514,4.881681828219501,1428097798996622
45.76750048677217,4.8808811588311105,1428097809000305
45.76027328418287,4.875067354917794,1428097819001801
45.76122582605794,4.8879426904641186,1428097829002811
45.763763604306426,4.881958618746448,1428097838997135
45.761223159471285,4.884075535247278,1428097848995698
45.75793426328224,4.881980346305079,1428097858995977
45.76526540487982,4.883521314651611,1428097868994073
45.765348126779685,4.879095698876299,1428097879006398
45.76244691831639,4.875038938575833,1428097889001926
45.75645209389082,4.881505450933764,1428097899002731
45.76473719864806,4.876881333244205,1428097909008281
45.75875313686356,4.874412964572638,1428097919001659
45.768898976758614,4.876691753664483,1428097928994818
45.755629566635385,4.883746135609242,1428097942994824
45.76026301683876,4.876026153675374,1428097952996604
45.76742556561527,4.8849271003156645,1428097962993892
45.76379855181745,4.880752166966857,1428097972999982
45.75583426148448,4.876793507745664,1428097983004182
45.75783965055496,4.868746578609939,1428097992998422
45.759482573746205,4.8774351102451465,1428098003003007
45.76990507422391,4.8810062522951485,1428098012997890
45.76681459776493,4.879956326665295,1428098022998950
45.762918572565745,4.884403335012318,1428098032998372
45.76378363200182,4.883737354705343,1428098042994526
45.76542981942902,4.880900520607567,1428098053002315
45.76464694677006,4.881968306013004,1428098063000791
45.7647804762635,4.8836853142901075,1428098073000813
45.765603442331795,4.881840119573048,1428098082995924
45.76133178211444,4.8840424026865605,1428098093001797
45.76449457942479,4.885811399196372,1428098102997199
45.76057470233955,4.882815157296588,1428098113004839
45.7552277989328,4.873483208482348,1428098122997843
45.76715413975794,4.87613547272354,1428098133005679
45.76053511414249,4.874654980075344,1428098142999182
45.76608043027168,4.880477752824131,1428098152999366
45.7636703852198,4.878063896711458,1428098163001971
45.76086257390503,4.873905994310959,1428098172996162
45.75862522990774,4.872371396722492,1428098183002590
45.76043254386249,4.875054434552216,1428098193001092
45.75953837897341,4.87011213738878,1428098203003699
45.764475561707314,4.8795939280698795,1428098212999790
45.7562261068727,4.878965551936451,1428098222998621
45.76377309594401,4.875172370416661,1428098363992251
45.75918593831687,4.877727207015132,1428098374000644
45.76731541117884,4.888231766459831,1428098383997813
45.7644766007032,4.878266932070542,1428098393994145
45.75789799441572,4.876488763059688,1428098404004493
45.761778942745586,4.879449944190922,1428098413997005
45.761279882145494,4.877905050631284,1428098554995857
45.75764751101809,4.887786784668625,1428098564994115
45.76415477385842,4.8788792070220115,1428098574993115
45.76159694303736,4.878989808709385,1428098584997438
45.76525621278244,4.879380084107461,1428098595000237
45.76085805383993,4.880960953960666,1428098604999578
45.76912242984709,4.878815000388522,1428098624999781
45.760469896582876,4.8771414091929,1428098635001455
45.75914540628313,4.882834176902206,1428098645002683
45.75566400850455,4.880673282108507,1428098659998895
45.76252037260478,4.873603377099314,1428100476002122
45.76035204968592,4.882730860632141,1428100486007745
45.75333770667871,4.880733780617473,1428104222999672
45.76178844625268,4.879905679397573,1428104232993728
45.763513360484644,4.880532278262449,1428104242999257
45.76637193494688,4.8840879635546885,1428104252998009
45.754171816083904,4.883242683411295,1428104263005312
45.76479251660155,4.882905650857669,1428104272996939
45.77040679393516,4.8770578442907375,1428104283001821
45.7585145353077,4.879196789124005,1428104292998030
45.76336551407834,4.882320650524823,1428104303003832
45.76534437052064,4.879320965544415,1428104313000654
45.76898061336879,4.877073842936168,1428104622998949
45.75953554009437,4.883470903584104,1428104633007321
45.762672946392215,4.879505455986732,1428104643002607
45.751089918878506,4.875359414925384,1428104670003160
45.76376938619221,4.881444060087925,1428104680002072
45.76091605804764,4.886624633427023,1428104689998470
45.75881052258017,4.876574205993471,1428104699997514
45.76547708090351,4.877040671448975,1428104709996699
45.7601886206127,4.8824543316000435,1428104719999836
45.76885271472207,4.877922022987499,1428104730003974
45.760526143316476,4.870494248406288,1428104739992256
45.76092916160114,4.880973575625478,1428104750001502
45.7635493457457,4.879977763644691,1428104760005072
45.77081330721895,4.868652670002312,1428104770000421
45.75544939212421,4.880751120899823,1428104780003268
45.75322796255945,4.876767588548037,1428104789997962
45.7577500862642,4.876038683583206,1428104799997894
45.76255887946473,4.881361983643071,1428104809997406
45.768952077432104,4.891073633896097,1428104819994812
45.75606925456248,4.875024235180149,1428104829996662
45.76588121452664,4.8795763876570994,1428104839998856
45.76735545770628,4.876123731265028,1428104849995627
45.77026639285961,4.877186248214176,1428104860001809
45.75884597376234,4.884406834420631,1428104870000333
45.7508331183072,4.879333316969863,1428104880005880
45.76628445309268,4.876332217837508,1428104889997346
45.76235344731409,4.881512176775084,1428104899998112
45.7616733954977,4.870734213875606,1428106108996489
45.76290001829501,4.8784061077420455,1428106118998569
45.76546820033425,4.877294832904353,1428106128994057
45.758680315945796,4.867236011540095,1428106138998423
45.767181712451155,4.881156088072566,1428106148999906
45.77400024580685,4.879862547560351,1428106245997024
45.75785802647105,4.881260744341508,1428106278994269
45.7653213220613,4.8786327979250705,1428106289000004
45.76882972362663,4.886623306486556,1428106298999982
45.76816380612636,4.881957764045879,1428106320999311
45.75595930524137,4.884007612741734,1428106330996904
45.762219400679065,4.8804064461623495,1428106351995086
45.75921457684982,4.877379880565171,1428106362000686
45.76951074152861,4.877662690545972,1428106372003683
45.760395525213184,4.884536436106713,1428106381998658
45.7617128012846,4.87783239828922,1428106391998459
45.755715014722256,4.8716950434548005,1428109682996484
45.76693204940066,4.886142792936083,1428109693004024
45.760687398664246,4.876949414551548,1428109702997910
45.759007182279944,4.880043748647535,1428109713003135
45.764795718009665,4.882872535427449,1428109722997659
45.765056630581896,4.883506432778498,1428109732999754
45.76625291885126,4.8798190744933905,1428109742999775
45.762016891198414,4.883970540365192,1428109752997363
45.75835755611135,4.879208040675589,1428109763000617
45.75912874371214,4.880236114901507,1428109772999410
45.763767870713714,4.879061968989437,1428109782997997
45.767305659422064,4.884760800132493,1428109793000752
45.76266539782931,4.874240448691755,1428109802996325
45.75622956714574,4.88270073554133,1428109813005272
45.755620995855594,4.886568059564711,1428109823008367
45.755094868479866,4.881979357407814,1428109832995101
45.76298605756053,4.876185362412767,1428109847996785
45.75936494990522,4.878941820372368,1428109858001044
45.75759770269279,4.874488885014427,1428109868001980
45.762780773042934,4.888728731354944,1428109877999020
45.757926164315904,4.882392283864327,1428109888000502
45.761808285427925,4.8759388623815685,1428109898001127
45.759762965757126,4.879960120520651,1428109907996664
45.76171663599851,4.883988212695787,1428109918003559
45.76009443854067,4.880785584143095,1428109927995752
45.76659967615127,4.882373156029545,1428109938000070
45.75986786832453,4.884238290216824,1428109947996432
45.75948680188328,4.874853944549745,1428109958001899
45.76115707859741,4.885724445492898,1428109967995078
45.76179639498834,4.880022127672179,1428109978000907
45.75576046010562,4.882212468533837,1428109988001439
45.766007323255934,4.875709425382286,1428109997995786
45.76182874142269,4.878001666855551,1428110007999338
45.764066839557735,4.870711750856251,1428110018003089
45.75815796240174,4.882094140435005,1428110028001787
45.75787166294245,4.88048526944181,1428110037999559
45.75887323234801,4.8727919507704875,1428110047995450
45.75549921107146,4.884848228574722,1428110058000483
45.76146123377063,4.884212106909481,1428110068001295
45.76969403163208,4.881488311127505,1428110078002321
45.76009283641043,4.891194981564359,1428110088002668
45.755186762625215,4.887554963607787,1428110097993201
45.76891109042765,4.878566596383091,1428110107995559
45.75918741326738,4.874527300202543,1428110201003655
45.757982058220236,4.885723797083361,1428110210999043
45.7621463777567,4.876116423588347,1428110264998964
45.76202312459511,4.879369698316362,1428110275004640
45.76061896155762,4.874580891073291,1428110284999563
45.76305976925062,4.875429381992193,1428110839997207
45.75719996744371,4.875973089098581,1428110850001927
45.76035304067375,4.884140098961509,1428110860006328
45.75844855765295,4.872582572308251,1428110878003394
45.76595485037815,4.876849354077408,1428110888003027
45.770269675808606,4.884897617132507,1428110898002882
45.757923338843014,4.869713210328628,1428110940997246
45.764035246844315,4.883553467098248,1428111132997405
45.75603476447569,4.882917137418362,1428111143005991
45.76060530880472,4.87454266283187,1428111152998843
45.769249782643584,4.886997387722595,1428111162998365
45.77163509008044,4.881369371050441,1428111172995637
45.762183926093435,4.88448978607522,1428111183001633
45.75727432867196,4.8786574145451915,1428111193001362
45.7668504215841,4.8858303340605325,1428111203000573
45.756268240580106,4.887685675381271,1428111215998119
45.758173756563494,4.880761450240265,1428111226001467
45.75784728958776,4.881176526586813,1428111235997615
45.76141472280868,4.881068736390997,1428111245994347
45.75749648737914,4.878569596958386,1428111255995424
45.76762131703266,4.878505085880749,1428111266001540
45.76090449151108,4.879650915629549,1428111275999529
45.76261362872672,4.882849697842952,1428111286002558
45.76195529741144,4.880361591796082,1428111295996228
45.76645831113601,4.885956828284624,1428111306007025
45.766711795507135,4.8792127390507,1428111316005770
45.75756133518563,4.886961816360835,1428111325997699
45.76086271910748,4.882309550770761,1428111336000834
45.76346161923145,4.877145893512324,1428111346003659
45.75812340337101,4.884296161274893,1428111356000193
45.74970880741048,4.88236867388586,1428111366003826
45.75736934961292,4.873077842210509,1428111375996828
45.7509536906224,4.88229624225709,1428111385999824
45.763789477744425,4.878439063933765,1428111585001292
45.76032368605256,4.883381098711528,1428111596996788
45.75625122193102,4.876775858437086,1428111606999792
45.76278182974509,4.87884827254641,1428111617004928
45.761314779431856,4.887579705374246,1428111629993371
45.76604883074444,4.88165540748294,1428111640002388
45.75762213376695,4.880808162686349,1428111650005603
45.75964413013176,4.884299549527665,1428111674995103
45.75792727779171,4.888637619885557,1428111685000770
45.76155097345213,4.886664380314514,1428111694998196
45.75733971801663,4.877124045773772,1428111726004308
45.763142953718436,4.8750398162545885,1428111735998322
45.758657946994205,4.877114942653759,1428111746002877
45.75845140682552,4.874373351367919,1428111756002690
45.76834706323716,4.881131751831929,1428111779997184
45.76882478288018,4.872781209439599,1428111789998246
45.753299579562906,4.878961417260173,1428111800001040
45.76540336545553,4.885587497734971,1428111809999286
45.75492672092123,4.8752933293617104,1428111819995946
45.76487638003949,4.880093270562132,1428111829998406
45.75873615205447,4.886410730154701,1428111840000504
45.761921666723666,4.8855037385457925,1428111849998388
45.76098767282007,4.880061634232789,1428111859993738
45.75832741300463,4.883211689532551,1428111870004805
45.76116057157047,4.880561429606473,1428111879995752
45.75956208838393,4.870226487904577,1428111889999793
45.7602639371393,4.885011747647639,1428111900006543
45.76269240892548,4.873377991251678,1428111910002762
45.75431814387621,4.883097091418924,1428111919994864
45.76063695111304,4.881094561549545,1428111929999788
45.76235499846522,4.882072543631312,1428111939998581
45.7599089319778,4.88186242025229,1428111949999768
45.76165201004823,4.882417428233355,1428111960000932
45.76547015993486,4.8872333995359805,1428111969999008
45.76791522738687,4.882172824369245,1428111980004572
45.76083251585509,4.8856058805945795,1428111990005916
45.762429730109176,4.8762861953657515,1428112000001304
45.757051003855125,4.881096732881254,1428112009999489
45.76755093477696,4.880868459209349,1428112020001279
45.763834030636595,4.8895206593825264,1428112030003320
45.75384171437726,4.8814328093697625,1428112040001017
45.763459622122056,4.8771372192982545,1428112049994247
45.75877038358025,4.881188432344,1428112059999514
45.76002105647205,4.878854084093033,1428112070005886
45.76516718234683,4.890312484848151,1428112080000521
45.75750991150431,4.873126522692192,1428112090001967
45.761301359485834,4.884839917882872,1428112143996240
45.75856770456944,4.874979219331495,1428112243998970
45.761690204853906,4.873172245097109,1428112253993304
45.75525132037935,4.881015782090755,1428112263994497
45.76798459117477,4.882010814253403,1428112274001286
45.75768018964102,4.8830859406677956,1428112284006016
45.766745358205725,4.871882374801801,1428112293995662
45.76269156680806,4.89023752449943,1428112303997781
45.76863998180128,4.873701300192559,1428112314000006
45.75463504440638,4.8802616951553235,1428112324000152
45.766649669034265,4.881366476976554,1428112333999891
45.76074915970364,4.8754803650242735,1428112344000105
45.76004583042162,4.876817239885105,1428112353997785
45.75818237874643,4.885768120298081,1428112364001346
45.7584870102311,4.887058376530127,1428112373998884
45.75603661684486,4.881400908951246,1428112384002568
45.76733948098598,4.88964868662503,1428112394000122
45.76937998871431,4.879019809944752,1428112404000226
45.76116323687647,4.873711035314533,1428112413998151
45.77408761831524,4.878400217115442,1428112423997007
45.763189575457375,4.877922000350749,1428112433997076
45.763622263522294,4.878052996386109,1428112443999555
45.7616497793332,4.885630286214429,1428112453997317
45.76088335814899,4.873247849374101,1428112463998215
45.76057447534538,4.87732141688548,1428112473995090
45.76576941024823,4.876294914582059,1428112483996463
45.76062489413212,4.879516552541624,1428112493995758
45.76155639024148,4.887784734356908,1428112503999223
45.75745198236841,4.877995386640287,1428112513998160
45.76548693027329,4.88340225595198,1428112523999739
45.76320217357544,4.878395816301436,1428112534002650
45.76384590806966,4.876778945179269,1428112543998445
45.75341772271191,4.885821840235582,1428112553999110
45.75539602222933,4.876257780984365,1428112563998487
45.75533640916871,4.883174389276319,1428112574000374
45.76891926284048,4.879455091873176,1428112584003833
45.77018186008201,4.877647439883335,1428112594007127
45.753941266243196,4.8816223918736465,1428112603999768
45.75820599887266,4.880166688829685,1428112614006877
45.76473607675931,4.880622604990073,1428112624002415
45.763705881718415,4.876229776750942,1428112633999614
45.759337406159695,4.879996342255325,1428112643999946
45.76468477399036,4.877360362516124,1428112653992646
45.7743248489056,4.877949315081273,1428112664001282
45.76477373446262,4.8758127187135525,1428112674000069
45.75725986562174,4.879874366502933,1428112683997416
45.76856202435391,4.877656964019641,1428112694005069
45.76187664136201,4.874334707331221,1428112704007247
45.76734130237482,4.881482657779416,1428112713992436
45.7574268533563,4.877931594593609,1428112723998714
45.77224371377313,4.877664088174537,1428112733999012
45.76021528829656,4.877710139847764,1428112744000625
45.762118350986675,4.882946649210547,1428112754004513
45.769659395577946,4.888097849672895,1428112763996769
45.766352978556355,4.880840502827904,1428112773998373
45.760914792066345,4.8862122776497,1428112783999682
45.76271286783874,4.876570546935205,1428112793997174
45.7590427425705,4.8777799516238565,1428112804002516
45.75434304290055,4.874544881028032,1428112813996453
45.76376628477779,4.892211241175949,1428112823999203
45.75681204467137,4.885158770430556,1428112834004112
45.76090715248356,4.874114356112416,1428113193996823
45.76404366212964,4.889636987196555,1428113204002260
45.75772894496584,4.880719076679005,1428113213998938
45.75856314254162,4.87970859275427,1428113223997969
45.75508610657199,4.880039365324197,1428113234003245
45.758949814904234,4.878098300617939,1428113243997368
45.76296256812105,4.875390692099092,1428113253996511
45.7642834615924,4.879277760866511,1428113264000833
45.75972335003222,4.878947247951928,1428113273999323
45.76872033452454,4.8814937747677485,1428113283996261
45.7592776430698,4.8863026504738185,1428113294002408
45.7611044813788,4.881931279878409,1428113303999018
45.76602141342776,4.875193098180756,1428113314001951
45.76457473852687,4.870603748476426,1428113324002372
45.7745141843705,4.877708631157717,1428113334001273
45.75665814567183,4.875451663824178,1428113344000501
45.75517870876639,4.88240343353317,1428113353998788
45.76035785950968,4.883137872952018,1428113364003327
45.75808978080987,4.875972782552047,1428113374005057
45.75976457292006,4.878000786450536,1428113397998348
45.759398201712834,4.8821026121582,1428113408000998
45.759902388603166,4.883591237180043,1428113417997345
45.758309557774155,4.8812812172628135,1428113480006871
45.76770990041295,4.876214284578865,1428113490004652
45.758941208763744,4.8864778202039165,1428113499995297
45.76602306213911,4.881693605529567,1428113527997778
45.762365499042296,4.88108644246442,1428113538004662
45.758439031501155,4.880222140092771,1428113548003737
45.76191124841085,4.878404986017781,1428113558000005
45.76949803359623,4.878827806292344,1428113568003772
45.75819298162216,4.873889948445803,1428113577994660
45.763419328813164,4.889599645737538,1428113587996432
45.76675889597199,4.884787314356369,1428113597997623
45.762441644952105,4.879209411994692,1428113608001465
45.762734529469256,4.887580266524891,1428113618003539
45.76511956233749,4.885898698895946,1428113628003008
45.755686619014924,4.888647875812622,1428113638001066
45.767936139754426,4.8802606458824735,1428113648006228
45.76573645893674,4.8815108754959375,1428113658001320
45.761419021989596,4.876462528223934,1428113668001702
45.75594140814827,4.876645573457107,1428113677994997
45.769192570438506,4.883985630982543,1428113687996704
45.76500846320229,4.880521605452977,1428113697996105
45.76615314308837,4.880848442495139,1428113707998885
45.76087966615392,4.8827711434464245,1428113717999489
45.75717175498011,4.886292711660026,1428113727998937
45.75598149864423,4.878412728129371,1428113737997208
45.76414854708289,4.885680913152884,1428113748000613
45.758215063623844,4.874838945748119,1428113757997334
45.75864424998574,4.877309736240979,1428113767991710
45.756168910551374,4.8766990155479615,1428113777999627
45.76138343906881,4.883577355494331,1428113788001972
45.762604389602295,4.875289175719262,1428113798005679
45.758438582864514,4.886343908458738,1428113807999280
45.76362734210499,4.880300629889847,1428113818000625
45.765481009392126,4.876631459195099,1428114282001582
45.75932151856785,4.890464986135793,1428114292001616
45.765851170591006,4.8807171609539965,1428114421001546
45.76529123968437,4.879215052738032,1428114430999558
45.75946151385435,4.882034935772952,1428114452999931
45.77014762804186,4.882125167373547,1428114462994649
45.758157925743255,4.876153198044237,1428114559002417
45.76412469353753,4.8773510530342135,1428114619999220
45.764264482924986,4.882678006752876,1428114629998297
45.7617404073932,4.870755220365739,1428114640000566
45.76321314758652,4.883038646222056,1428114650001552
45.76124316291877,4.880556410316422,1428114660004695
45.76937429184226,4.874088940911446,1428114670000517
45.7605399445256,4.87816843558071,1428114679998657
45.757391175801736,4.888401560798486,1428114690999909
45.75825669728895,4.879162106623406,1428114701000296
45.761583092693215,4.880495109115612,1428114711004910
45.757189083680544,4.881816080629063,1428114721004264
45.761527532371886,4.877988722628188,1428114735996394
45.76145393039932,4.872987910094795,1428114763000246
45.76165209478491,4.880694338676988,1428114773001000
45.762133642009495,4.877615545576621,1428114782996569
45.76891715401701,4.874583101674355,1428114793003320
45.75707253598224,4.875134359348823,1428114802994447
45.7654821198993,4.886367727423799,1428114813002193
45.758717373979906,4.874958727287291,1428114822998761
45.76975725764413,4.8814751354320025,1428114832998495
45.75368154573549,4.877936744947089,1428114843005589
45.765291708121424,4.875513719026897,1428114853002237
45.76228442883701,4.876863325734149,1428114863001312
45.760968341902434,4.884655999724022,1428114872997473
45.764049745232995,4.877759924065264,1428114882998728
45.75833886105502,4.874360231765872,1428114892996284
45.75861748226688,4.885458530547969,1428114903000923
45.76610738216787,4.881911971634672,1428114913000384
45.76161581344519,4.878103370951832,1428114959004800
45.7657461467183,4.878614014680135,1428114986997539
45.75124174514461,4.877953046495602,1428114997001165
45.77002686416103,4.875420351889113,1428115344001118
45.75320247307551,4.879727683578903,1428115354005352
45.76207731423918,4.876772806667288,1428115364001613
45.757642213301736,4.878375831886298,1428115374003938
45.76230248077912,4.882709569675208,1428115383997465
45.75885366280567,4.87392992449188,1428115393999058
45.75419695504987,4.880920663979329,1428115403999436
45.762454567716524,4.875762932632573,1428115413997456
45.75960807581975,4.883933064658949,1428115424000570
45.75776233398881,4.882900633767058,1428115433996010
45.76232171945454,4.881394205431035,1428115443995777
45.76391866659382,4.876161277967537,1428115454003934
45.759750670189746,4.873494778849874,1428115464005777
45.75454862560065,4.883920032284035,1428115473997943
45.7653461460585,4.874370568296028,1428115484001114
45.763193222823716,4.876547291932033,1428115493996204
45.76444196661914,4.880686508534076,1428115503996377
45.75989248534598,4.8744204780090366,1428115514000966
45.7577924161626,4.871565239347941,1428115523999712
45.75850027882336,4.877104127200794,1428115533993534
45.76352775781178,4.873054156462797,1428115543994657
45.76112619191803,4.87623948152565,1428115554002313
45.75961956396251,4.881339008119795,1428115563996496
45.75785373515877,4.881567852182183,1428115573994983
45.762720483935375,4.877646587999313,1428115584002769
45.76653866740756,4.882938263743955,1428115593997078
45.77041748680678,4.880150067602243,1428115603999930
45.76374727056715,4.880011138772712,1428115613995603
45.757053114101524,4.8890033159595525,1428115623995736
45.76196511792025,4.880525644032198,1428115634003569
45.764539639906886,4.8787733474273685,1428115643999568
45.76204042126088,4.880799795556758,1428115653998000
45.76464671188844,4.890561710158051,1428115664004838
45.763757974547204,4.882293551659538,1428115674004278
45.76270455557751,4.879281684852332,1428115683991801
45.764139513606764,4.886159678359398,1428115693995632
45.76898114455528,4.883559773908646,1428115704004807
45.761701208523874,4.881787366790836,1428115714000543
45.761980062283286,4.884760740983783,1428115724000647
45.757141788419894,4.8750401884463725,1428115733999507
45.760056122830925,4.873529378750467,1428115743998349
45.75772409355004,4.8731135376160895,1428115753996161
45.75724846025733,4.879395628982319,1428115763999901
45.770090247931535,4.880417743148143,1428115773997203
45.76914615563175,4.877463777247371,1428115783998908
45.76169242108628,4.876940350712948,1428115793997623
45.767823686539124,4.881207889324883,1428115803994991
45.765383499829596,4.877212103031967,1428115813998767
45.757755408323604,4.874942944471467,1428115957001195
45.7661101482109,4.877064698159684,1428115966997003
45.75858433229798,4.887282916052835,1428115977009461
45.76421243893452,4.874267236541089,1428115986996081
45.76039595588097,4.8823680051519345,1428115997000261
45.76458046972621,4.878129754307857,1428116006998260
45.75816803749515,4.890666782510863,1428116016996208
45.76350444420581,4.882489875648625,1428116027002603
45.76378481501063,4.877849526561331,1428116036992539
45.76627735650749,4.885041316134367,1428116047004148
45.77059804506874,4.871571263872366,1428116057004427
45.765184916419756,4.881771168288976,1428116067001712
45.75489296288862,4.872910992697956,1428116077001331
45.76398224800756,4.879892472913635,1428116086996085
45.77504006012757,4.879339379324947,1428116096992301
45.76394624541736,4.880896147869428,1428116106995930
45.7620585471089,4.871474023020194,1428116117002262
45.76843763508669,4.875041790880694,1428116126995847
45.76340249022596,4.883534962743226,1428116137000457
45.76399786234349,4.876128167769976,1428116146995996
45.766467655001314,4.879634663135691,1428116156994016
45.75619385147081,4.8766940268118875,1428116166997008
45.76654746423733,4.884841150204683,1428116176999898
45.75690261901475,4.880781563929313,1428116187004295
45.763259462469684,4.87955167820883,1428116197001745
45.75480225013792,4.883221848406049,1428116206999568
45.76226363332624,4.878570159645033,1428116216997944
45.76821156315435,4.872476818106879,1428116227002415
45.76688446874063,4.879307621953122,1428116237002865
45.75969816630668,4.87769269458494,1428116247001106
45.76016173347366,4.883174096550605,1428116257003188
45.77243574305538,4.882334736712271,1428116267001632
45.76152536245128,4.88184437508207,1428116276996928
45.75899130934829,4.877286349954996,1428116286990103
45.76231732058012,4.882274920697141,1428116296998393
45.7640866085032,4.886479152436925,1428116307006166
45.75625540731018,4.884283693213171,1428116317006682
45.76806560872375,4.881612619934782,1428116326996482
45.75805341183484,4.887338002819326,1428116337004549
45.75850882377354,4.886776597563681,1428116346995082
45.752730002195634,4.877947728427294,1428116356995182
45.77024981975586,4.874461576409635,1428116367004776
45.758296763923006,4.877207561191311,1428116377001619
45.77229392978025,4.887206108255694,1428116387001452
45.76383605874875,4.874313255956855,1428116396999738
45.762610121194534,4.877064489602702,1428116407001393
45.76923933175623,4.874967946348517,1428116416993606
45.76228813798412,4.884173947562363,1428116427000207
45.761052006249244,4.88384426054575,1428116437003039
45.754963548265415,4.877153287427172,1428116446997139
45.76970242822302,4.884512086652516,1428116456997212
45.76449738620969,4.877349829531798,1428116467000480
45.76181213485681,4.878610951430795,1428116477000063
45.759047083982104,4.880176059415856,1428116486997716
45.76030474681977,4.871394444439767,1428116496999673
45.76257505297238,4.878617903737322,1428116507000691
45.764875570309755,4.878370827099224,1428116516992685
45.76222376759507,4.874760810930938,1428116526999832
45.760983501834374,4.8744151191918865,1428116537003292
45.760749487378654,4.876837981358212,1428116546994213
45.76351726185363,4.881580747707964,1428116557004282
45.760947964708265,4.881892317819398,1428116567001818
45.75578130979654,4.8816766363308615,1428116577005332
45.76138714167992,4.882403658718612,1428116587000256
45.76335123356874,4.884643244842521,1428116596996525
45.76066342035515,4.878255053183483,1428116607001786
45.75445089799915,4.876501061940678,1428116617002360
45.75882255340877,4.879864540886708,1428116627001539
45.76085060462705,4.877489694988542,1428116636998741
45.765935329041945,4.8712261679653075,1428116646993252
45.76657700068713,4.868879533688601,1428116657001295
45.77364687860784,4.882027845860027,1428116666995846
45.76500242930822,4.883009180589444,1428116676998785
45.75372581267035,4.873440272225564,1428116687005638
45.77025571105714,4.879746700420157,1428116696990961
45.7696234300377,4.880347240081735,1428116707001785
45.76701554364566,4.879057327586038,1428116716992664
45.75621753036405,4.880065645407449,1428116726991363
45.76301222528519,4.882046941533859,1428116737000681
45.75846579922651,4.889201619791905,1428116747003856
45.764947261685286,4.878167418830728,1428116756992822
45.765532470480906,4.880306512312003,1428116767000244
45.755812277690154,4.88598996596915,1428116776999216
45.76063222089351,4.880752777222264,1428116787000412
45.76377791743826,4.884590372978565,1428116797001637
45.75889448190633,4.882692876367792,1428116807004042
45.773051292177044,4.870276475304876,1428116816994273
45.76973517811416,4.876634938780797,1428116826998243
45.75353042066527,4.881304221881873,1428116836997332
45.76392770037599,4.8856041574225975,1428116846997771
45.767187726266705,4.881489245903466,1428116856996189
45.762606239568406,4.8784160182759475,1428116866996130
45.76073049930567,4.877725492930035,1428116876999771
45.76011886934381,4.8901450272035305,1428116901000645
45.76441163857206,4.874339552440926,1428116911003862
45.76610090228928,4.878698732049601,1428116920999032
45.76853188756605,4.8803678912117325,1428116931005584
45.75909718026617,4.882918872618251,1428116941005625
45.75746085801412,4.875346743618434,1428116950999179
45.76079980256452,4.884863884803789,1428116960996871
45.76076825130565,4.8856670516573,1428116971007436
45.76612568625752,4.8789233808084616,1428116980999550
45.75877745501227,4.87325224918724,1428116990998376
45.76549650017486,4.8805705479368235,1428117000998041
45.76227575426862,4.876614302186477,1428117010999133
45.76646660750704,4.88306338889881,1428117021000197
45.76371022523184,4.876532987878765,1428117030993431
45.76572421124037,4.8757399740513305,1428117041000686
45.7618747110863,4.87290661513418,1428117051002398
45.76397262758916,4.869601933443104,1428117061006087
45.75232466326537,4.880123559436501,1428117071005847
45.75218952934238,4.875921155408712,1428117081004707
45.76046945584917,4.873721857166749,1428117091001199
45.75560153759512,4.881153375809027,1428117100995771
45.76458558082789,4.877183905430672,1428117111000230
45.76536913301095,4.882862921666435,1428117121000346
45.76586347390774,4.880067103168015,1428117130997732
45.76839919171487,4.877824724879256,1428117140996215
45.761492035429896,4.8809697060941435,1428117151000570
45.753654840439644,4.884001279854764,1428117161005632
45.761458288330324,4.8750673906791215,1428117171002572
45.76103459452422,4.880515869575778,1428117180998002
45.76130046048883,4.874286383713484,1428117190995648
45.76316307809721,4.880344506351073,1428117201001429
45.76833017980758,4.875711079230408,1428117210995369
45.76969871579517,4.877541246298463,1428117221002405
45.77079733738697,4.8859464705892295,1428117231004841
45.76741278889293,4.87355121172794,1428117241000959
45.76402616279321,4.882821967537657,1428117250993730
45.75969243166621,4.877889375825857,1428117260997979
45.76594779358703,4.882135829790039,1428117271002399
45.77043299944822,4.879388172899217,1428117281004552
45.7626751423674,4.873561160952579,1428117291005537
45.76692540386778,4.876766642077725,1428117301000047
45.76808818892876,4.880829076819576,1428117311001043
45.75318571024523,4.884940924666077,1428117321001705
45.75999276392494,4.884914587144466,1428117330991735
45.76697047635474,4.875663938920592,1428117340999756
45.761511771457634,4.871279196895271,1428117350995030
45.76338611656827,4.880936093750775,1428117360998499
45.760208817600244,4.881196048385736,1428117371000710
45.761953199134744,4.882665463310791,1428117381004354
45.76091652214412,4.880260300193752,1428117391002487
45.75509144683592,4.877474592337478,1428117400998531
45.761698914671655,4.869462333316335,1428117410999160
45.7664058033882,4.876735256728342,1428117420998561
45.759068823406736,4.876485571029569,1428117430995036
45.7569682903669,4.878981876252434,1428117440999645
45.7602864984959,4.875694280956656,1428117451008578
45.759348154682755,4.883617697473202,1428117461000372
45.764164705952524,4.877766800037425,1428117471005313
45.76935147716511,4.8821834820403724,1428117481003122
45.75681432522034,4.879415588824205,1428117491007837
45.76266534946385,4.887622918870779,1428117500998500
45.763307524984825,4.874179330925122,1428117510997981
45.761199531202394,4.880611229235095,1428117521006836
45.76406414636771,4.886642619981087,1428117530992289
45.75571207105858,4.880981886097803,1428117541000623
45.76512832741583,4.885737109782368,1428117550997707
45.77104177021966,4.879539023744946,1428117560993263
45.761498305548876,4.877070910790437,1428117570997801
45.76918651058856,4.875433011602858,1428117580996109
45.76353807626504,4.88109801796645,1428117590999971
45.76546750557491,4.883668680579796,1428117601001331
45.76401083048482,4.879733145879956,1428117611000150
45.7591614289135,4.872493366443489,1428117620995163
45.75196384765007,4.879342745358366,1428117631001739
45.7595082065508,4.8812430049299635,1428117641001188
45.76229513092714,4.885160295117546,1428117694002043
45.76119279031206,4.875858524141579,1428117704005474
45.76100755609515,4.88481454515113,1428117713998905
45.75968726126886,4.874968545378924,1428117724003400
45.76706617189515,4.883651580670808,1428117734003911
45.76364266556396,4.881084808360116,1428117743999967
45.75865403462431,4.883666799387342,1428117754005254
45.76684454207414,4.885095593662491,1428117763999366
45.75410762042268,4.8772092142161805,1428117773999326
45.75522264774517,4.8859990982825305,1428117784000651
45.75983189358975,4.881262648804655,1428117793999866
45.761343114787685,4.874454883142229,1428117803995996
45.75590925770758,4.875488557262835,1428117813997074
45.763997901451894,4.881803424613903,1428117824002251
45.75838950577627,4.878888004751461,1428117834003045
45.76177578626032,4.882236966833848,1428117843997560
45.76325570774014,4.8810721366482825,1428117853996181
45.76094380909788,4.87691370081759,1428117864000002
45.763486770422105,4.883065976161292,1428117873994348
45.75736150130365,4.8760441295503405,1428117884004281
45.763421951752015,4.869573253920116,1428117894007182
45.7565004893897,4.877295227870795,1428117903994608
45.76100472895077,4.879469347371478,1428117924999089
45.76631246628777,4.885278803924049,1428117939000057
45.763114150195854,4.888768663052664,1428117949005224
45.76584274510572,4.870718428056332,1428117958996636
45.756387377259806,4.8857293650189995,1428117968997055
45.762135599139945,4.878755272136878,1428117978993967
45.7653570225921,4.885175177833668,1428117989002896
45.765469934608326,4.884723896281973,1428117999001830
45.7613420300319,4.889951017356567,1428118009003400
45.760146799202786,4.876644874078254,1428118018999452
45.76466483905833,4.88431535817624,1428118028998253
45.762346612077806,4.883162183270241,1428118038997688
45.75756527916039,4.887437362534241,1428118048998396
45.75844628216715,4.870314142418282,1428118059006795
45.75786971018357,4.882630564082215,1428118068999039
45.76179245511112,4.884358709976819,1428118078995512
45.76214050060355,4.881868867677617,1428118088996201
45.76441943371097,4.882101323992272,1428118099005594
45.75729257794573,4.881992447381282,1428118109008207
45.76711410523196,4.88049112146039,1428118118999191
45.76245516453293,4.873656848929394,1428118129004130
45.757255257228074,4.888254179563389,1428118139002341
45.768749831633265,4.8787259111083285,1428118148999949
45.752717232351536,4.881833629854479,1428118159000391
45.765457587152866,4.872191292301468,1428118169001057
45.767272927627886,4.883524655208714,1428118178999093
45.76735876500501,4.877266696010813,1428118189003671
45.75941109521922,4.880010678312436,1428118198996338
45.762108331675876,4.889884064223265,1428118209005055
45.759004915040094,4.887321107157254,1428118219000898
45.76502731518858,4.8809260984495495,1428118228998061
45.76046952110645,4.87982157862928,1428118238999236
45.7668913418225,4.877776695245243,1428118249001960
45.766329738297586,4.8751492756862245,1428118259000578
45.764041019713645,4.879209907299257,1428118269003531
45.7550962224603,4.871779329646142,1428118279002468
45.76755347639233,4.877253983992902,1428118289002811
45.767238335111934,4.878930054030761,1428118299002652
45.768148801331186,4.875907753058141,1428118308999196
45.76800788770282,4.8827459118934255,1428118328000360
45.756607161036904,4.875140125041968,1428118338001190
45.76286128510922,4.882212015343971,1428118348005047
45.75933793847042,4.886055799992443,1428118357995938
45.75636809932573,4.8690094548460054,1428118368002725
45.755848859685706,4.880952987330004,1428118377996026
45.7605551122918,4.886230602513536,1428118388001281
45.765381164400154,4.878430096149929,1428118398009292
45.756568917800664,4.8798833299242315,1428118408001596
45.761283386523836,4.880354127833076,1428118418001566
45.75986496240011,4.878813042753729,1428118427997920
45.76812540800563,4.884915011810105,1428118437996778
45.77453829888461,4.877499373268312,1428118447998545
45.75637621899159,4.888542197804025,1428118458001222
45.75869517349091,4.886035421126513,1428118468001395
45.76436211164873,4.884396222865156,1428118477993833
45.756963281032974,4.88529445665084,1428118488004346
45.750905633525655,4.882460003100541,1428118497997156
45.765142095493054,4.878942844648033,1428118508000743
45.76694669714979,4.869708085403932,1428118518000900
45.7670901319787,4.881062770350787,1428118527997315
45.765955266929254,4.882908748404717,1428118537997923
45.76329306288816,4.88283684346192,1428118547997540
45.757520675657815,4.881614979915566,1428118558006884
45.76016915615517,4.8859921401226645,1428118568000549
45.76434489882208,4.8735364060743365,1428118577999536
45.75513163002511,4.875968832095794,1428118587998039
45.766916400405414,4.885346660472317,1428118598001147
45.76501873484443,4.892500504493585,1428118608002301
45.76410019863512,4.872784856083442,1428118617998660
45.765020769740744,4.882902941296507,1428118627996042
45.758111075430826,4.8822139026909035,1428118638002074
45.759390382348606,4.8805536393508895,1428118648003094
45.759879296098674,4.878009110077635,1428118658009508
45.75748510640999,4.874025682966147,1428118668006414
45.76646341955894,4.87934454436962,1428118677999688
45.76450182444646,4.8754626514078785,1428118687999152
45.7622065557429,4.878818403297631,1428118697998856
45.76182663421894,4.872956684223653,1428118707993069
45.76311632907326,4.875621771882771,1428118758999440
45.760536793340954,4.8811680626122715,1428118769006898
45.75418246636247,4.87753834249318,1428118818002928
45.76514271276888,4.876684025007254,1428118828003160
45.75967930055539,4.879956892374593,1428118837991351
45.76305908750897,4.879382474704466,1428118848004527
45.76461656518022,4.8789414199557095,1428118858004189
45.76368279430471,4.8795606014689605,1428118983005301
45.76833823145607,4.880080235739614,1428118993000586
45.75127726918743,4.874069976907764,1428119003001410
45.76899851893015,4.8840603293354,1428119012996997
45.76283831923912,4.8771793971473,1428119023001577
45.76354513098851,4.881186702028483,1428119032995077
45.770277714849634,4.878240903347011,1428119043001661
45.765585560545595,4.886802261725186,1428119052996597
45.76172919414766,4.872869395520992,1428119266001369
45.75815512940074,4.888132914073825,1428119299003036
45.7586168667573,4.876032781603126,1428119316000050
45.763957412731244,4.876960959145993,1428119326007424
45.76462923368421,4.8808733585410105,1428119336001981
45.762389126457876,4.8734960392716316,1428119345999906
45.76977354465594,4.87994592476986,1428119356001357
45.75481098734398,4.8780173176824,1428119365998343
45.764073914150316,4.879375599913241,1428119375997447
45.765873365358,4.883079968320948,1428119386009977
45.76402723996615,4.876520526286965,1428119396000233
45.76772619752217,4.878374796956357,1428119406000090
45.75602263448242,4.87766281568582,1428119416001015
45.76429038376907,4.87643073450253,1428119426004094
45.75945009629445,4.874278065109228,1428119435992860
45.767451573880095,4.872193997782799,1428119445994918
45.76797105699139,4.875688472743454,1428119455996064
45.77205727194709,4.875429743253611,1428119465996294
45.765004371602544,4.882436376544861,1428119475997888
45.769742741282954,4.88278581136512,1428119485998906
45.76380467505928,4.8703777327367845,1428119496003581
45.762114335489436,4.879264439431093,1428119505997838
45.76204794434245,4.8765912335732695,1428119516002314
45.77691785817126,4.866971349754897,1428119526001129
45.76449714993479,4.88245560026913,1428119536002825
45.77080838996669,4.8707872152731895,1428119545999762
45.7640509300403,4.880548233600297,1428119555995857
45.75953545455642,4.874465425295156,1428119565996800
45.7576754447232,4.880910834245176,1428119575996395
45.75064914543087,4.876343204129514,1428119586002529
45.76201293830847,4.884554188292962,1428119595997085
45.76503298161383,4.889701480902572,1428119606001912
45.76327472105306,4.887061170625195,1428119615997867
45.76598488636924,4.881666612923792,1428119625999539
45.75681400450048,4.8785697373816115,1428119636004488
45.76457820791953,4.875306026816967,1428119645995823
45.763999854170805,4.883374659530922,1428119656002588
45.75516275166126,4.8779398583408655,1428119665996700
45.770003800543115,4.884633502555497,1428119675995310
45.75928794858349,4.8896087078340456,1428119685997668
45.76452464883756,4.883821920693404,1428119695998176
45.761478578624136,4.894600325400279,1428119706004169
45.75698526737061,4.882669511020471,1428119716007871
45.76897701298569,4.878675458972747,1428119725999371
45.76824118829817,4.8711057730185185,1428119735997843
45.75570385585829,4.86821026302689,1428119745996174
45.754566239847975,4.872684655436127,1428119756000012
45.76087772851731,4.875964845824402,1428119765995808
45.76652603509837,4.88001769387306,1428119775999885
45.75715818549198,4.878226730102853,1428119786005329
45.752911703204575,4.874778021800896,1428119795999925
45.75513723788156,4.872450893439603,1428119805995012
45.76375355290459,4.878053562881881,1428119816003776
45.75609284601245,4.879161251729282,1428119826000851
45.76553371486504,4.881427688183934,1428119836005170
45.76345695591105,4.88145071558543,1428119845991321
45.76596030689961,4.889295909210573,1428119856007396
45.76541601057545,4.887143156756113,1428119865998421
45.763906922511225,4.88480483359715,1428119875997745
45.75973035203403,4.873803257645464,1428119886001440
45.75398396202864,4.8881084021893715,1428119896000120
45.76101755313647,4.882456526009977,1428119905999095
45.768796154656506,4.877505328781531,1428119916000738
45.75828801780253,4.874093933531916,1428119925992337
45.76411683968708,4.873889314933206,1428120015001578
45.76064701584698,4.881355737128805,1428120107997288
45.76044201818527,4.873450306097659,1428120186998411
45.76271244765181,4.887128817045693,1428120196996735
45.76680791261268,4.8823086193192795,1428120207002155
45.766177986315626,4.880268853237738,1428120216994971
45.771798319036904,4.876651771126795,1428120227009085
45.76260273691019,4.8797325113033265,1428120236998908
45.76580958505638,4.881535416059272,1428120247003320
45.76673816893358,4.875004057303719,1428120257000215
45.76545697536072,4.875782503154651,1428120266995648
45.76167601090872,4.883352356783471,1428120277000990
45.76307674171865,4.885116612683815,1428120286998331
45.75650892056587,4.872810025559983,1428120296995020
45.75984395986082,4.882582098673985,1428120307001490
45.764974085095666,4.878208526286488,1428120317001938
45.75983890618073,4.878996612593723,1428120327004149
45.75945069725864,4.884034927583244,1428120337004710
45.75908223390058,4.886938033246857,1428120347003549
45.76896293073302,4.885832033910842,1428120356997002
45.76700956539713,4.87628073021598,1428120367000722
45.75496794407803,4.8798192528672235,1428120376998144
45.758948892025224,4.881958233336078,1428120386997710
45.75752485476655,4.881127789452121,1428120397000569
45.759617320748866,4.880011133413129,1428120407001886
45.76318285690916,4.877590490228585,1428120416997645
45.75771277705073,4.871827474253037,1428120426996153
45.75900720432805,4.88271700736186,1428120436998919
45.761061749410366,4.883901396143308,1428120446996931
45.758603732280534,4.885452217101756,1428120456997608
45.76398824962139,4.872726467035562,1428120467000491
45.76601593462099,4.879086139632434,1428120477001090
45.758541051631205,4.886341298195004,1428120487004817
45.755626771568195,4.885630015333589,1428120496999843
45.76551127777201,4.887326520042629,1428120506996135
45.76007315887265,4.877187409849051,1428120516999953
45.76389740714097,4.872716366862773,1428120527004646
45.76533404108046,4.881730746886973,1428120536999090
45.765640200753886,4.885299024408606,1428120547004523
45.75689968167217,4.882998898959561,1428120557001047
45.76068483702673,4.88354388366829,1428120566997753
45.761207544501566,4.873681656015892,1428120577002948
45.76006922195227,4.880122418808263,1428120587000057
45.77107271236581,4.875732662347362,1428120596999255
45.761090996469584,4.885523700570412,1428120607002111
45.76616449969187,4.878282796929863,1428120617003157
45.75742681898264,4.879333063167252,1428120626998570
45.76848278800324,4.877849680090727,1428120636994530
45.76439546080524,4.880802123033251,1428120646995939
45.76157797589717,4.882296494274828,1428120657001142
45.75186418336578,4.88789766024429,1428120666994942
45.76482373915832,4.879609084995506,1428120677003568
45.75337404116998,4.885540344609135,1428120687002037
45.765340139400124,4.881141157922637,1428120697004143
45.771476048715726,4.880175142198359,1428120707002231
45.765174337261094,4.873032719600511,1428120717006994
45.766348418416435,4.87454969383721,1428120726989785
45.763273774546896,4.874424666740861,1428120736995459
45.759745880705495,4.8790064249170415,1428120747002189
45.76134199777536,4.886371076029566,1428120757006669
45.75602389822079,4.871298522291157,1428120767004381
45.75844660158384,4.883145054971712,1428120777000452
45.765069009831564,4.866889044662983,1428120787000039
45.76145208910452,4.888748119492224,1428120796998344
45.7622310023918,4.8866526095921605,1428120807000876
45.76039420437733,4.878236789941949,1428120817001291
45.766742731729536,4.88536910092131,1428120827002407
45.76301147103174,4.877016041807011,1428120836990248
45.760041670295784,4.881748971420814,1428120847002961
45.762697929914616,4.881172422762584,1428120857000986
45.76089148723918,4.873307159435775,1428120867005406
45.76820688864098,4.876272448561622,1428120876997292
45.76355475304889,4.881079901903893,1428120887004972
45.76824239538932,4.878166121247013,1428120896994492
45.76854628315798,4.8743319516064805,1428120906999010
45.75456543996903,4.88229043811781,1428120916999823
45.767625708106515,4.8788975869773274,1428120927005538
45.76505705962432,4.874203792856467,1428120937002847
45.75977266239367,4.87416710953461,1428120947001395
45.76048569967802,4.880820899128949,1428121089999400
45.762499929327106,4.879477397324834,1428121100002252
45.761149128182446,4.877769153590107,1428121109998790
45.75929631743941,4.874925068450714,1428121120002212
45.766101114582945,4.871977504038169,1428121129998522
45.76051128411584,4.878617099820262,1428121140004145
45.76056319876341,4.880884865151624,1428121149997231
45.75535606699215,4.876767457615503,1428121159995427
45.7619518529485,4.885945493525234,1428121169995343
45.765642630070374,4.87960374548746,1428121180001857
45.756835877076455,4.879332875849782,1428121190001867
45.75968768180002,4.873553741891272,1428121200002666
45.76935119016539,4.879205071080709,1428121209998849
45.75870444264012,4.876294737528039,1428121220003535
45.7607909776257,4.880760245675483,1428121230005737
45.759421513685936,4.888305180519184,1428121240008442
45.75837249712929,4.884917350742059,1428121250003884
45.76185860161326,4.88843731579486,1428121259996454
45.758194456645235,4.883257144088353,1428121270004561
45.76337286847255,4.884922593671972,1428121280000124
45.765827072210364,4.8689118012986246,1428121289999014
45.760450873005475,4.884510180815085,1428121299998144
45.758763569093595,4.877355943790112,1428121309999455
45.7575966126195,4.87684018435197,1428121320001115
45.760688461957734,4.882185996757049,1428121330003223
45.763876256514884,4.8824542890873985,1428121340001591
45.76663518675646,4.879555701057618,1428121350000707
45.76093989759232,4.879341802179635,1428121405003658
45.76266526353807,4.874203971227303,1428121414999134
45.7635642086503,4.88467686416172,1428121424999400
45.761586697113195,4.879718815217898,1428121435002813
45.76107166007737,4.880490483563647,1428121522002942
45.764847062722716,4.885843053383233,1428121531995279
45.75980711688094,4.875318881500989,1428121543993589
45.763398769902366,4.881433688104568,1428121553997992
45.76113477193594,4.879122662056739,1428121563995337
45.765698951187765,4.881069582074987,1428121652000306
45.76403301696229,4.88184188473824,1428121689996278
45.768124868566844,4.87360700086423,1428121705992958
45.76224626205423,4.880141872668402,1428121716001872
45.765409138350186,4.883434680404608,1428121726003852
45.758104215337475,4.885046401735865,1428121757998023
45.76904359518393,4.883795342098859,1428121771995548
45.75527059574591,4.88057833381111,1428121782005757
45.76257554980255,4.877429111081112,1428121821997999
45.77565637016373,4.88024344188075,1428121832002519
45.76232364314685,4.882712062909071,1428121842004021
45.76084097616954,4.879835185612573,1428121851996828
45.76369531888064,4.878209597217449,1428121861996801
45.77302075516652,4.875931423286328,1428121872004596
45.761838248926644,4.880766858753028,1428121881994666
45.759834729819154,4.877153561232847,1428121892003991
45.7587039028739,4.885081266103432,1428121902001918
45.759949998720664,4.8862438606132,1428121912000557
45.76336958092491,4.885165075782939,1428121922002012
45.76858576997979,4.880031551646053,1428121931996077
45.76166382172818,4.871777139462353,1428121941998537
45.76842691600874,4.882891832614521,1428121951994810
45.76773010967923,4.886091668315233,1428121962004275
45.763767538055276,4.881070819221817,1428121971992426
45.76983634239339,4.8725730560529525,1428121981996924
45.76114256524091,4.882309007478157,1428121992003285
45.766666929940804,4.876416870181655,1428122001995796
45.76407671269442,4.871581884743073,1428122012000189
45.761866485909074,4.887805841274028,1428122021997278
45.76049840839132,4.874105249922879,1428122032006993
45.75870580532946,4.884106808775915,1428122042000871
45.761143758747195,4.877021231624756,1428122052005741
45.75689716017217,4.877719829012155,1428122061999563
45.76875137997078,4.880756276434274,1428122071999743
45.75982771183284,4.882525264579615,1428122082004416
45.76904434542791,4.876431804702917,1428122091999968
45.76193287702133,4.881513959163083,1428122102002579
45.76554401586678,4.881434187035026,1428122112005787
45.75915166833895,4.879032172593243,1428122121994255
45.758542287008424,4.878615676247253,1428122132008499
45.75573482552861,4.879241150786136,1428122142008378
45.756800454783495,4.87992799728724,1428122151996360
45.761009527504164,4.874760193123562,1428122185001691
45.76661435724555,4.87764902890614,1428122195002931
45.759083205512624,4.882007362654389,1428122205001915
45.76213518817237,4.8781393232357235,1428122214995009
