{
    "fr": [
        {
            "id": 2723,
            "family_id": 823,
            "name": "Salon de jardin",
            "image": {
                "large_url": "https://cdn{{ environment_string }}.manomano.com/media/homepage/categories/large/garden-furniture.jpg",
                "small_url": "https://cdn{{ environment_string }}.manomano.com/media/homepage/categories/small/garden-furniture.jpg"
            },
            "url": "/salon-table-et-chaise-de-jardin-2723"
        },
        {
            "id": 3056,
            "family_id": 823,
            "name": "Barbecue",
            "image": {
                "small_url": "https://cdn{{ environment_string }}.manomano.com/media/homepage/categories/small/grills.jpg"
            },
            "url": "/barbecue-3056"
        },
        {
            "id": 2828,
            "family_id": 823,
            "name": "Jeux d'extérieur",
            "image": {
                "small_url": "https://cdn{{ environment_string }}.manomano.com/media/homepage/categories/small/outdoor-toys.jpg"
            },
            "url": "/jeux-dexterieur-et-de-jardin-2828"
        },
        {
            "id": 1828,
            "family_id": 823,
            "name": "Pergola",
            "image": {
                "small_url": "https://cdn{{ environment_string }}.manomano.com/media/homepage/categories/small/pergolas.jpg"
            },
            "url": "/tonnelle-et-pergola-1828"
        },
        {
            "id": 2494,
            "family_id": 4605,
            "name": "Armoire et penderie",
            "image": {
                "small_url": "https://cdn{{ environment_string }}.manomano.com/media/homepage/categories/small/wardrobes.jpg"
            },
            "url": "/armoire-et-penderie-2494"
        }
    ],
    "de": [
        {
            "id": 2723,
            "family_id": 823,
            "name": "Gartenmöbel",
            "image": {
                "large_url": "https://cdn{{ environment_string }}.manomano.com/media/homepage/categories/large/garden-furniture.jpg",
                "small_url": "https://cdn{{ environment_string }}.manomano.com/media/homepage/categories/small/garden-furniture.jpg"
            },
            "url": "/gartenmoebel-2723"
        },
        {
            "id": 3056,
            "family_id": 823,
            "name": "Barbecue",
            "image": {
                "small_url": "https://cdn{{ environment_string }}.manomano.com/media/homepage/categories/small/grills.jpg"
            },
            "url": "/barbecue-grillgeraet-3056"
        },
        {
            "id": 2828,
            "family_id": 823,
            "name": "Spiele für draußen",
            "image": {
                "small_url": "https://cdn{{ environment_string }}.manomano.com/media/homepage/categories/small/outdoor-toys.jpg"
            },
            "url": "/spiele-fuer-draussen-2828"
        },
        {
            "id": 1828,
            "family_id": 823,
            "name": "Pergolen",
            "image": {
                "small_url": "https://cdn{{ environment_string }}.manomano.com/media/homepage/categories/small/pergolas.jpg"
            },
            "url": "/pergolen-1828"
        },
        {
            "id": 2494,
            "family_id": 4605,
            "name": "Kleiderschränke",
            "image": {
                "small_url": "https://cdn{{ environment_string }}.manomano.com/media/homepage/categories/small/wardrobes.jpg"
            },
            "url": "/kleiderschraenke-2494"
        }
    ],
    "it": [
        {
            "id": 2723,
            "family_id": 823,
            "name": "Mobili da giardino",
            "image": {
                "large_url": "https://cdn{{ environment_string }}.manomano.com/media/homepage/categories/large/garden-furniture.jpg",
                "small_url": "https://cdn{{ environment_string }}.manomano.com/media/homepage/categories/small/garden-furniture.jpg"
            },
            "url": "/mobili-da-giardino-2723"
        },
        {
            "id": 3056,
            "family_id": 823,
            "name": "Barbecue",
            "image": {
                "small_url": "https://cdn{{ environment_string }}.manomano.com/media/homepage/categories/small/grills.jpg"
            },
            "url": "/barbecue-3056"
        },
        {
            "id": 2828,
            "family_id": 823,
            "name": "Giochi da giardino",
            "image": {
                "small_url": "https://cdn{{ environment_string }}.manomano.com/media/homepage/categories/small/outdoor-toys.jpg"
            },
            "url": "/giochi-da-giardino-2828"
        },
        {
            "id": 1828,
            "family_id": 823,
            "name": "Pergole",
            "image": {
                "small_url": "https://cdn{{ environment_string }}.manomano.com/media/homepage/categories/small/pergolas.jpg"
            },
            "url": "/pergole-1828"
        },
        {
            "id": 2494,
            "family_id": 4605,
            "name": "Armadi e guardaroba",
            "image": {
                "small_url": "https://cdn{{ environment_string }}.manomano.com/media/homepage/categories/small/wardrobes.jpg"
            },
            "url": "/armadi-e-guardaroba-2494"
        }
    ],
    "es": [
        {
            "id": 2723,
            "family_id": 823,
            "name": "Muebles de jardín",
            "image": {
                "large_url": "https://cdn{{ environment_string }}.manomano.com/media/homepage/categories/large/garden-furniture.jpg",
                "small_url": "https://cdn{{ environment_string }}.manomano.com/media/homepage/categories/small/garden-furniture.jpg"
            },
            "url": "/muebles-de-jardin-2723"
        },
        {
            "id": 3056,
            "family_id": 823,
            "name": "Barbacoas",
            "image": {
                "small_url": "https://cdn{{ environment_string }}.manomano.com/media/homepage/categories/small/grills.jpg"
            },
            "url": "/barbacoas-3056"
        },
        {
            "id": 2828,
            "family_id": 823,
            "name": "Juegos al aire libre",
            "image": {
                "small_url": "https://cdn{{ environment_string }}.manomano.com/media/homepage/categories/small/outdoor-toys.jpg"
            },
            "url": "/juegos-al-aire-libre-2828"
        },
        {
            "id": 1828,
            "family_id": 823,
            "name": "Pérgolas",
            "image": {
                "small_url": "https://cdn{{ environment_string }}.manomano.com/media/homepage/categories/small/pergolas.jpg"
            },
            "url": "/cenadores-y-pergolas-1828"
        },
        {
            "id": 2494,
            "family_id": 4605,
            "name": "Armarios y roperos",
            "image": {
                "small_url": "https://cdn{{ environment_string }}.manomano.com/media/homepage/categories/small/wardrobes.jpg"
            },
            "url": "/armarios-y-roperos-2494"
        }
    ],
    "gb": [
        {
            "id": 2723,
            "family_id": 823,
            "name": "Garden furniture",
            "image": {
                "large_url": "https://cdn{{ environment_string }}.manomano.com/media/homepage/categories/large/garden-furniture.jpg",
                "small_url": "https://cdn{{ environment_string }}.manomano.com/media/homepage/categories/small/garden-furniture.jpg"
            },
            "url": "/garden-furniture-2723"
        },
        {
            "id": 3056,
            "family_id": 823,
            "name": "Grills",
            "image": {
                "small_url": "https://cdn{{ environment_string }}.manomano.com/media/homepage/categories/small/grills.jpg"
            },
            "url": "/grills-3056"
        },
        {
            "id": 2828,
            "family_id": 823,
            "name": "Outdoor toys",
            "image": {
                "small_url": "https://cdn{{ environment_string }}.manomano.com/media/homepage/categories/small/outdoor-toys.jpg"
            },
            "url": "/outdoor-toys-2828"
        },
        {
            "id": 1828,
            "family_id": 823,
            "name": "Pergolas",
            "image": {
                "small_url": "https://cdn{{ environment_string }}.manomano.com/media/homepage/categories/small/pergolas.jpg"
            },
            "url": "/pergolas-1828"
        },
        {
            "id": 2494,
            "family_id": 4605,
            "name": "Wardrobes",
            "image": {
                "small_url": "https://cdn{{ environment_string }}.manomano.com/media/homepage/categories/small/wardrobes.jpg"
            },
            "url": "/wardrobes-2494"
        }
    ]
}
