{
  "folders": {
    "templates": "templates/",
    "static": "",
    "output": "public/",
    "modules": ".modules/"
  },
  "modules": {
    "dependencies": {
      "file": "build.antipy.com/std@1.0.0-pre17",
      "yaml": "build.antipy.com/std@1.0.0-pre17",
      "util": "build.antipy.com/std@1.0.0-pre17"
    }
  },
  "pages": {
    "sites": [
      {
        "slug": "index.html",
        "templates": ["data.html"],
        "data": ["[file_file:data/data.yaml][yaml_yaml]"]
      },
      {
        "slug": "frontmatter.html",
        "templates": ["data.html"],
        "data": [
          "[file_file:data/yaml.md][yaml_frontmatter:---][util_prefix:frontmatter]",
          "[file_file:data/yaml.md][util_frontmatterbody:---]"
        ]
      }
    ]
  }
}
