{
  "folders": {
    "templates": "templates/",
    "static": "",
    "output": "public/",
    "modules": ".modules/"
  },
  "modules": {
    "dependencies": {
      "file": "build.antipy.com/std@1.0.0-pre17",
      "util": "build.antipy.com/std@1.0.0-pre17",
      "markdown": "build.antipy.com/std@1.0.0-pre17"
    }
  },
  "pages": {
    "slug": "index.html",
    "templates": ["markdown.html"],
    "data": ["[file_file:data/data.md][util_plaintext:body]"]
  }
}
