{
  "folders": {
    "templates": "templates/",
    "static": "",
    "output": "public/",
    "modules": ".modules/"
  },
  "modules": {
    "dependencies": {
      "deno": "build.antipy.com/std@1.0.0-pre17",
      "json": "build.antipy.com/std@1.0.0-pre17",
      "util": "build.antipy.com/std@1.0.0-pre17"
    }
  },
  "pages": {
    "sites": [
      {
        "slug": "one.html",
        "templates": ["data.html"],
        "data": ["[deno_deno:data/test.ts][json_json]"]
      },
      {
        "iterators": {
          "txt": "[deno_iterator:data/iterator.ts('three')]"
        },
        "slug": "two.html",
        "templates": ["data.html"],
        "data": [
          "[range:txt][util_echo:{{txt}}][util_plaintext:{{txt}}]"
        ]
      }
    ]
  }
}
