{
  "folders": {
    "templates": "templates/",
    "static": "",
    "output": "public/",
    "modules": ".modules/"
  },
  "modules": {
    "dependencies": {
      "math": "build.antipy.com/std@1.0.0-pre17"
    }
  },
  "pages": {
    "slug": "index.html",
    "templates": ["math.html"]
  }
}
