{
  "folders": {
    "templates": "templates/",
    "static": "",
    "output": "public/",
    "modules": ".modules/"
  },
  "modules": {
    "dependencies": {
      "file": "build.antipy.com/std@1.0.0-pre17",
      "util": "build.antipy.com/std@1.0.0-pre17"
    }
  },
  "pages": {
    "sites": [
      {
        "iterators": {
          "txt": "[file_folder:data/iterator]"
        },
        "slug": "one.html",
        "templates": ["data.html"],
        "data": [
          "[range:txt][file_file:data/iterator/{{txt}}][util_plaintext:{{txt}}]"
        ]
      },
      {
        "iterators": {
          "txt": "[file_pattern:data/iterator/*.txt]"
        },
        "slug": "two.html",
        "templates": ["data.html"],
        "data": [
          "[range:txt][file_file:data/iterator/{{txt}}.txt][util_plaintext:{{txt}}]"
        ]
      }
    ]
  }
}
