[gd_scene load_steps=3 format=2]

[ext_resource path="res://scenes/HUD.tscn" type="PackedScene" id=1]
[ext_resource path="res://scripts/game_controller.gd" type="Script" id=2]

[node name="Main" type="Node"]
script = ExtResource( 2 )

[node name="CountdownTimer" type="Timer" parent="."]
one_shot = true

[node name="HUD" parent="." instance=ExtResource( 1 )]

[connection signal="timeout" from="CountdownTimer" to="." method="_on_CountdownTimer_timeout"]
[connection signal="start" from="HUD" to="." method="_on_HUD_start"]
