[
  {
    "id": 1,
    "intitule": "J2EE"
  },
  {
    "id": 2,
    "intitule": "Java"
  },
  {
    "id": 3,
    "intitule": "C++"
  },
  {
    "id": 4,
    "intitule": "Python"
  },
  {
    "id": 5,
    "intitule": "Javascript"
  }
]