<?xml version="1.0" encoding="UTF-8"?>
<session version="1.0">
<refactoring accessors="true" comment="Delete element from project &apos;PharmacieAdministration&apos;&#x0D;&#x0A;- Original project: &apos;PharmacieAdministration&apos;&#x0D;&#x0A;- Original element: &apos;org.sid.entities.Famille.java&apos;" description="Delete element" element1="/src\/main\/java&lt;org.sid.entities{Famille.java" elements="1" flags="589830" id="org.eclipse.jdt.ui.delete" resources="0" stamp="1523364120597" subPackages="false" version="1.0"/>
</session>