<?xml version="1.0" encoding="UTF-8" standalone="no"?>
<!-- Generator: Fusion 360, Shaper Origin Export Add-In, Version 1.5.0  -->

<svg
   enable-background="new 0 0 78.5 78.5"
   height="78.5cm"
   shaper:fusionaddin="version:1.5.0"
   version="1.1"
   viewBox="0 0 78.5 78.5"
   width="78.5cm"
   x="0cm"
   xml:space="preserve"
   y="0cm"
   id="svg332"
   sodipodi:docname="STD_INF_PLATE.svg"
   inkscape:version="1.1.1 (3bf5ae0d25, 2021-09-20)"
   xmlns:inkscape="http://www.inkscape.org/namespaces/inkscape"
   xmlns:sodipodi="http://sodipodi.sourceforge.net/DTD/sodipodi-0.dtd"
   xmlns="http://www.w3.org/2000/svg"
   xmlns:svg="http://www.w3.org/2000/svg"
   xmlns:shaper="http://www.shapertools.com/namespaces/shaper"><defs
     id="defs336" /><sodipodi:namedview
     id="namedview334"
     pagecolor="#ffffff"
     bordercolor="#666666"
     borderopacity="1.0"
     inkscape:pageshadow="2"
     inkscape:pageopacity="0.0"
     inkscape:pagecheckerboard="0"
     inkscape:document-units="cm"
     showgrid="false"
     inkscape:zoom="0.17526539"
     inkscape:cx="1480.6118"
     inkscape:cy="1486.3174"
     inkscape:window-width="1366"
     inkscape:window-height="705"
     inkscape:window-x="-8"
     inkscape:window-y="-8"
     inkscape:window-maximized="1"
     inkscape:current-layer="svg332" /><path
     d="M-24.0523911,58.0676089 L-26.6121177,51.8878823 -26.6121177,26.6121177 -24.0523911,20.4323911 -6.1797265,2.5597265 -0,0 25.2757646,0 31.4554912,2.5597265 49.3281558,20.4323911 51.8878823,26.6121177 51.8878823,51.8878823 49.3281558,58.0676089 31.4554912,75.9402735 25.2757646,78.5 -0,78.5 -6.1797265,75.9402735 -24.0523911,58.0676089z"
     fill="rgb(0,0,0)"
     shaper:cutDepth="0"
     shaper:pathType="exterior"
     transform="matrix(1,0,0,-1,26.6121177,78.5)"
     vector-effect="non-scaling-stroke"
     id="path2"
     style="stroke:#0000ff;fill:none" /><path
     d="M31.1272402,7.7412987 a0.15,0.15 0 1,1 0.3,0 a0.15,0.15 0 1,1 -0.3,0z"
     fill="rgb(255,255,255)"
     shaper:cutDepth="0"
     shaper:pathType="interior"
     stroke="rgb(0,0,0)"
     transform="matrix(1,0,0,-1,26.6121177,78.5)"
     vector-effect="non-scaling-stroke"
     id="path4"
     style="stroke:#ff0000" /><path
     d="M43.9965836,20.6106421 a0.15,0.15 0 1,1 0.3,0 a0.15,0.15 0 1,1 -0.3,0z"
     fill="rgb(255,255,255)"
     shaper:cutDepth="0"
     shaper:pathType="interior"
     stroke="rgb(0,0,0)"
     transform="matrix(1,0,0,-1,26.6121177,78.5)"
     vector-effect="non-scaling-stroke"
     id="path6"
     style="stroke:#ff0000" /><path
     d="M33.0364285,5.8321104 a0.15,0.15 0 1,1 0.3,0 a0.15,0.15 0 1,1 -0.3,0z"
     fill="rgb(255,255,255)"
     shaper:cutDepth="0"
     shaper:pathType="interior"
     stroke="rgb(0,0,0)"
     transform="matrix(1,0,0,-1,26.6121177,78.5)"
     vector-effect="non-scaling-stroke"
     id="path8"
     style="stroke:#ff0000" /><path
     d="M45.9057719,18.7014538 a0.15,0.15 0 1,1 0.3,0 a0.15,0.15 0 1,1 -0.3,0z"
     fill="rgb(255,255,255)"
     shaper:cutDepth="0"
     shaper:pathType="interior"
     stroke="rgb(0,0,0)"
     transform="matrix(1,0,0,-1,26.6121177,78.5)"
     vector-effect="non-scaling-stroke"
     id="path10"
     style="stroke:#ff0000" /><path
     d="M34.5179355,16.3714187 a0.15,0.15 0 1,1 0.3,0 a0.15,0.15 0 1,1 -0.3,0z"
     fill="rgb(255,255,255)"
     shaper:cutDepth="0"
     shaper:pathType="interior"
     stroke="rgb(0,0,0)"
     transform="matrix(1,0,0,-1,26.6121177,78.5)"
     vector-effect="non-scaling-stroke"
     id="path12"
     style="stroke:#ff0000" /><path
     d="M35.3664636,17.2199468 a0.15,0.15 0 1,1 0.3,0 a0.15,0.15 0 1,1 -0.3,0z"
     fill="rgb(255,255,255)"
     shaper:cutDepth="0"
     shaper:pathType="interior"
     stroke="rgb(0,0,0)"
     transform="matrix(1,0,0,-1,26.6121177,78.5)"
     vector-effect="non-scaling-stroke"
     id="path14"
     style="stroke:#ff0000" /><path
     d="M-12.0096849,59.5963479 a0.2,0.2 0 1,1 0.4,0 a0.2,0.2 0 1,1 -0.4,0z"
     fill="rgb(255,255,255)"
     shaper:cutDepth="0"
     shaper:pathType="interior"
     stroke="rgb(0,0,0)"
     transform="matrix(1,0,0,-1,26.6121177,78.5)"
     vector-effect="non-scaling-stroke"
     id="path16"
     style="stroke:#ff0000" /><path
     d="M-7.9084656,63.6975673 a0.2,0.2 0 1,1 0.4,0 a0.2,0.2 0 1,1 -0.4,0z"
     fill="rgb(255,255,255)"
     shaper:cutDepth="0"
     shaper:pathType="interior"
     stroke="rgb(0,0,0)"
     transform="matrix(1,0,0,-1,26.6121177,78.5)"
     vector-effect="non-scaling-stroke"
     id="path18"
     style="stroke:#ff0000" /><path
     d="M11.6039988,40.1338835 a0.15,0.15 0 1,1 0.3,0 a0.15,0.15 0 1,1 -0.3,0z"
     fill="rgb(255,255,255)"
     shaper:cutDepth="0"
     shaper:pathType="interior"
     stroke="rgb(0,0,0)"
     transform="matrix(1,0,0,-1,26.6121177,78.5)"
     vector-effect="non-scaling-stroke"
     id="path20"
     style="stroke:#ff0000" /><path
     d="M12.1643585,38.0425927 a0.15,0.15 0 1,1 0.3,0 a0.15,0.15 0 1,1 -0.3,0z"
     fill="rgb(255,255,255)"
     shaper:cutDepth="0"
     shaper:pathType="interior"
     stroke="rgb(0,0,0)"
     transform="matrix(1,0,0,-1,26.6121177,78.5)"
     vector-effect="non-scaling-stroke"
     id="path22"
     style="stroke:#ff0000" /><path
     d="M13.6952896,39.5735238 a0.15,0.15 0 1,1 0.3,0 a0.15,0.15 0 1,1 -0.3,0z"
     fill="rgb(255,255,255)"
     shaper:cutDepth="0"
     shaper:pathType="interior"
     stroke="rgb(0,0,0)"
     transform="matrix(1,0,0,-1,26.6121177,78.5)"
     vector-effect="non-scaling-stroke"
     id="path24"
     style="stroke:#ff0000" /><path
     d="M-7.0079363,52.9011192 a0.15,0.15 0 1,1 0.3,0 a0.15,0.15 0 1,1 -0.3,0z"
     fill="rgb(255,255,255)"
     shaper:cutDepth="0"
     shaper:pathType="interior"
     stroke="rgb(0,0,0)"
     transform="matrix(1,0,0,-1,26.6121177,78.5)"
     vector-effect="non-scaling-stroke"
     id="path26"
     style="stroke:#ff0000" /><path
     d="M-1.155743,55.3048595 a0.15,0.15 0 1,1 0.3,0 a0.15,0.15 0 1,1 -0.3,0z"
     fill="rgb(255,255,255)"
     shaper:cutDepth="0"
     shaper:pathType="interior"
     stroke="rgb(0,0,0)"
     transform="matrix(1,0,0,-1,26.6121177,78.5)"
     vector-effect="non-scaling-stroke"
     id="path28"
     style="stroke:#ff0000" /><path
     d="M-3.0693036,42.0958396 L-0.9524264,47.2064334 -0.0285468,46.82375 -0.2581569,46.2694223 0.2037829,46.0780805 -1.7479026,41.3662949 -2.7582645,41.7848005 -3.0693036,42.0958396z"
     fill="rgb(255,255,255)"
     shaper:cutDepth="0"
     shaper:pathType="interior"
     stroke="rgb(0,0,0)"
     transform="matrix(1,0,0,-1,26.6121177,78.5)"
     vector-effect="non-scaling-stroke"
     id="path30"
     style="stroke:#ff0000" /><path
     d="M4.700444,51.7492002 L4.1461163,51.5195901 3.7634328,52.4434697 8.8447703,54.5482285 9.2143221,54.1786767 9.6035713,53.2389459 4.8917857,51.2872604 4.700444,51.7492002z"
     fill="rgb(255,255,255)"
     shaper:cutDepth="0"
     shaper:pathType="interior"
     stroke="rgb(0,0,0)"
     transform="matrix(1,0,0,-1,26.6121177,78.5)"
     vector-effect="non-scaling-stroke"
     id="path32"
     style="stroke:#ff0000" /><path
     d="M26.951893,17.0078148 a0.15,0.15 0 1,1 0.3,0 a0.15,0.15 0 1,1 -0.3,0z"
     fill="rgb(255,255,255)"
     shaper:cutDepth="0"
     shaper:pathType="interior"
     stroke="rgb(0,0,0)"
     transform="matrix(1,0,0,-1,26.6121177,78.5)"
     vector-effect="non-scaling-stroke"
     id="path34"
     style="stroke:#ff0000" /><path
     d="M29.9924521,20.0483739 a0.15,0.15 0 1,1 0.3,0 a0.15,0.15 0 1,1 -0.3,0z"
     fill="rgb(255,255,255)"
     shaper:cutDepth="0"
     shaper:pathType="interior"
     stroke="rgb(0,0,0)"
     transform="matrix(1,0,0,-1,26.6121177,78.5)"
     vector-effect="non-scaling-stroke"
     id="path36"
     style="stroke:#ff0000" /><path
     d="M33.2451433,17.6442109 a0.15,0.15 0 1,1 0.3,0 a0.15,0.15 0 1,1 -0.3,0z"
     fill="rgb(255,255,255)"
     shaper:cutDepth="0"
     shaper:pathType="interior"
     stroke="rgb(0,0,0)"
     transform="matrix(1,0,0,-1,26.6121177,78.5)"
     vector-effect="non-scaling-stroke"
     id="path38"
     style="stroke:#ff0000" /><path
     d="M30.8409803,20.0483739 a0.15,0.15 0 1,1 0.3,0 a0.15,0.15 0 1,1 -0.3,0z"
     fill="rgb(255,255,255)"
     shaper:cutDepth="0"
     shaper:pathType="interior"
     stroke="rgb(0,0,0)"
     transform="matrix(1,0,0,-1,26.6121177,78.5)"
     vector-effect="non-scaling-stroke"
     id="path40"
     style="stroke:#ff0000" /><path
     d="M23.0628057,13.1187275 a0.15,0.15 0 1,1 0.3,0 a0.15,0.15 0 1,1 -0.3,0z"
     fill="rgb(255,255,255)"
     shaper:cutDepth="0"
     shaper:pathType="interior"
     stroke="rgb(0,0,0)"
     transform="matrix(1,0,0,-1,26.6121177,78.5)"
     vector-effect="non-scaling-stroke"
     id="path42"
     style="stroke:#ff0000" /><path
     d="M26.1033648,17.8563429 a0.15,0.15 0 1,1 0.3,0 a0.15,0.15 0 1,1 -0.3,0z"
     fill="rgb(255,255,255)"
     shaper:cutDepth="0"
     shaper:pathType="interior"
     stroke="rgb(0,0,0)"
     transform="matrix(1,0,0,-1,26.6121177,78.5)"
     vector-effect="non-scaling-stroke"
     id="path44"
     style="stroke:#ff0000" /><path
     d="M31.6895084,20.8969021 a0.15,0.15 0 1,1 0.3,0 a0.15,0.15 0 1,1 -0.3,0z"
     fill="rgb(255,255,255)"
     shaper:cutDepth="0"
     shaper:pathType="interior"
     stroke="rgb(0,0,0)"
     transform="matrix(1,0,0,-1,26.6121177,78.5)"
     vector-effect="non-scaling-stroke"
     id="path46"
     style="stroke:#ff0000" /><path
     d="M34.0936714,18.492739 a0.15,0.15 0 1,1 0.3,0 a0.15,0.15 0 1,1 -0.3,0z"
     fill="rgb(255,255,255)"
     shaper:cutDepth="0"
     shaper:pathType="interior"
     stroke="rgb(0,0,0)"
     transform="matrix(1,0,0,-1,26.6121177,78.5)"
     vector-effect="non-scaling-stroke"
     id="path48"
     style="stroke:#ff0000" /><path
     d="M29.143924,20.8969021 a0.15,0.15 0 1,1 0.3,0 a0.15,0.15 0 1,1 -0.3,0z"
     fill="rgb(255,255,255)"
     shaper:cutDepth="0"
     shaper:pathType="interior"
     stroke="rgb(0,0,0)"
     transform="matrix(1,0,0,-1,26.6121177,78.5)"
     vector-effect="non-scaling-stroke"
     id="path50"
     style="stroke:#ff0000" /><path
     d="M22.2142775,13.9672556 a0.15,0.15 0 1,1 0.3,0 a0.15,0.15 0 1,1 -0.3,0z"
     fill="rgb(255,255,255)"
     shaper:cutDepth="0"
     shaper:pathType="interior"
     stroke="rgb(0,0,0)"
     transform="matrix(1,0,0,-1,26.6121177,78.5)"
     vector-effect="non-scaling-stroke"
     id="path52"
     style="stroke:#ff0000" /><path
     d="M-21.0121177,39.25 a0.15,0.15 0 1,1 0.3,0 a0.15,0.15 0 1,1 -0.3,0z"
     fill="rgb(255,255,255)"
     shaper:cutDepth="0"
     shaper:pathType="interior"
     stroke="rgb(0,0,0)"
     transform="matrix(1,0,0,-1,26.6121177,78.5)"
     vector-effect="non-scaling-stroke"
     id="path54"
     style="stroke:#ff0000" /><path
     d="M12.4878823,72.75 a0.15,0.15 0 1,1 0.3,0 a0.15,0.15 0 1,1 -0.3,0z"
     fill="rgb(255,255,255)"
     shaper:cutDepth="0"
     shaper:pathType="interior"
     stroke="rgb(0,0,0)"
     transform="matrix(1,0,0,-1,26.6121177,78.5)"
     vector-effect="non-scaling-stroke"
     id="path56"
     style="stroke:#ff0000" /><path
     d="M45.9878823,39.25 a0.15,0.15 0 1,1 0.3,0 a0.15,0.15 0 1,1 -0.3,0z"
     fill="rgb(255,255,255)"
     shaper:cutDepth="0"
     shaper:pathType="interior"
     stroke="rgb(0,0,0)"
     transform="matrix(1,0,0,-1,26.6121177,78.5)"
     vector-effect="non-scaling-stroke"
     id="path58"
     style="stroke:#ff0000" /><path
     d="M-19.1371177,40.3325318 a0.15,0.15 0 1,1 0.3,0 a0.15,0.15 0 1,1 -0.3,0z"
     fill="rgb(255,255,255)"
     shaper:cutDepth="0"
     shaper:pathType="interior"
     stroke="rgb(0,0,0)"
     transform="matrix(1,0,0,-1,26.6121177,78.5)"
     vector-effect="non-scaling-stroke"
     id="path60"
     style="stroke:#ff0000" /><path
     d="M13.5704141,70.875 a0.15,0.15 0 1,1 0.3,0 a0.15,0.15 0 1,1 -0.3,0z"
     fill="rgb(255,255,255)"
     shaper:cutDepth="0"
     shaper:pathType="interior"
     stroke="rgb(0,0,0)"
     transform="matrix(1,0,0,-1,26.6121177,78.5)"
     vector-effect="non-scaling-stroke"
     id="path62"
     style="stroke:#ff0000" /><path
     d="M44.1128823,38.1674682 a0.15,0.15 0 1,1 0.3,0 a0.15,0.15 0 1,1 -0.3,0z"
     fill="rgb(255,255,255)"
     shaper:cutDepth="0"
     shaper:pathType="interior"
     stroke="rgb(0,0,0)"
     transform="matrix(1,0,0,-1,26.6121177,78.5)"
     vector-effect="non-scaling-stroke"
     id="path64"
     style="stroke:#ff0000" /><path
     d="M-19.1371177,38.1674682 a0.15,0.15 0 1,1 0.3,0 a0.15,0.15 0 1,1 -0.3,0z"
     fill="rgb(255,255,255)"
     shaper:cutDepth="0"
     shaper:pathType="interior"
     stroke="rgb(0,0,0)"
     transform="matrix(1,0,0,-1,26.6121177,78.5)"
     vector-effect="non-scaling-stroke"
     id="path66"
     style="stroke:#ff0000" /><path
     d="M11.4053506,70.875 a0.15,0.15 0 1,1 0.3,0 a0.15,0.15 0 1,1 -0.3,0z"
     fill="rgb(255,255,255)"
     shaper:cutDepth="0"
     shaper:pathType="interior"
     stroke="rgb(0,0,0)"
     transform="matrix(1,0,0,-1,26.6121177,78.5)"
     vector-effect="non-scaling-stroke"
     id="path68"
     style="stroke:#ff0000" /><path
     d="M44.1128823,40.3325318 a0.15,0.15 0 1,1 0.3,0 a0.15,0.15 0 1,1 -0.3,0z"
     fill="rgb(255,255,255)"
     shaper:cutDepth="0"
     shaper:pathType="interior"
     stroke="rgb(0,0,0)"
     transform="matrix(1,0,0,-1,26.6121177,78.5)"
     vector-effect="non-scaling-stroke"
     id="path70"
     style="stroke:#ff0000" /><path
     d="M12.4878823,5.75 a0.15,0.15 0 1,1 0.3,0 a0.15,0.15 0 1,1 -0.3,0z"
     fill="rgb(255,255,255)"
     shaper:cutDepth="0"
     shaper:pathType="interior"
     stroke="rgb(0,0,0)"
     transform="matrix(1,0,0,-1,26.6121177,78.5)"
     vector-effect="non-scaling-stroke"
     id="path72"
     style="stroke:#ff0000" /><path
     d="M13.5704141,7.625 a0.15,0.15 0 1,1 0.3,0 a0.15,0.15 0 1,1 -0.3,0z"
     fill="rgb(255,255,255)"
     shaper:cutDepth="0"
     shaper:pathType="interior"
     stroke="rgb(0,0,0)"
     transform="matrix(1,0,0,-1,26.6121177,78.5)"
     vector-effect="non-scaling-stroke"
     id="path74"
     style="stroke:#ff0000" /><path
     d="M11.4053506,7.625 a0.15,0.15 0 1,1 0.3,0 a0.15,0.15 0 1,1 -0.3,0z"
     fill="rgb(255,255,255)"
     shaper:cutDepth="0"
     shaper:pathType="interior"
     stroke="rgb(0,0,0)"
     transform="matrix(1,0,0,-1,26.6121177,78.5)"
     vector-effect="non-scaling-stroke"
     id="path76"
     style="stroke:#ff0000" /><path
     d="M37.1268835,44.7814977 a0.15,0.15 0 1,1 0.3,0 a0.15,0.15 0 1,1 -0.3,0z"
     fill="rgb(255,255,255)"
     shaper:cutDepth="0"
     shaper:pathType="interior"
     stroke="rgb(0,0,0)"
     transform="matrix(1,0,0,-1,26.6121177,78.5)"
     vector-effect="non-scaling-stroke"
     id="path78"
     style="stroke:#ff0000" /><path
     d="M33.8216466,52.7610452 a0.15,0.15 0 1,1 0.3,0 a0.15,0.15 0 1,1 -0.3,0z"
     fill="rgb(255,255,255)"
     shaper:cutDepth="0"
     shaper:pathType="interior"
     stroke="rgb(0,0,0)"
     transform="matrix(1,0,0,-1,26.6121177,78.5)"
     vector-effect="non-scaling-stroke"
     id="path80"
     style="stroke:#ff0000" /><path
     d="M27.1536039,40.6504301 a0.15,0.15 0 1,1 0.3,0 a0.15,0.15 0 1,1 -0.3,0z"
     fill="rgb(255,255,255)"
     shaper:cutDepth="0"
     shaper:pathType="interior"
     stroke="rgb(0,0,0)"
     transform="matrix(1,0,0,-1,26.6121177,78.5)"
     vector-effect="non-scaling-stroke"
     id="path82"
     style="stroke:#ff0000" /><path
     d="M23.8483671,48.6299776 a0.15,0.15 0 1,1 0.3,0 a0.15,0.15 0 1,1 -0.3,0z"
     fill="rgb(255,255,255)"
     shaper:cutDepth="0"
     shaper:pathType="interior"
     stroke="rgb(0,0,0)"
     transform="matrix(1,0,0,-1,26.6121177,78.5)"
     vector-effect="non-scaling-stroke"
     id="path84"
     style="stroke:#ff0000" /><path
     d="M3.1079047,50.6104848 a0.15,0.15 0 1,1 0.3,0 a0.15,0.15 0 1,1 -0.3,0z"
     fill="rgb(255,255,255)"
     shaper:cutDepth="0"
     shaper:pathType="interior"
     stroke="rgb(0,0,0)"
     transform="matrix(1,0,0,-1,26.6121177,78.5)"
     vector-effect="non-scaling-stroke"
     id="path86"
     style="stroke:#ff0000" /><path
     d="M-1.0231629,60.5837643 a0.15,0.15 0 1,1 0.3,0 a0.15,0.15 0 1,1 -0.3,0z"
     fill="rgb(255,255,255)"
     shaper:cutDepth="0"
     shaper:pathType="interior"
     stroke="rgb(0,0,0)"
     transform="matrix(1,0,0,-1,26.6121177,78.5)"
     vector-effect="non-scaling-stroke"
     id="path88"
     style="stroke:#ff0000" /><path
     d="M11.0874523,53.9157216 a0.15,0.15 0 1,1 0.3,0 a0.15,0.15 0 1,1 -0.3,0z"
     fill="rgb(255,255,255)"
     shaper:cutDepth="0"
     shaper:pathType="interior"
     stroke="rgb(0,0,0)"
     transform="matrix(1,0,0,-1,26.6121177,78.5)"
     vector-effect="non-scaling-stroke"
     id="path90"
     style="stroke:#ff0000" /><path
     d="M6.9563846,63.8890011 a0.15,0.15 0 1,1 0.3,0 a0.15,0.15 0 1,1 -0.3,0z"
     fill="rgb(255,255,255)"
     shaper:cutDepth="0"
     shaper:pathType="interior"
     stroke="rgb(0,0,0)"
     transform="matrix(1,0,0,-1,26.6121177,78.5)"
     vector-effect="non-scaling-stroke"
     id="path92"
     style="stroke:#ff0000" /><path
     d="M0.1415281,46.4205725 a0.15,0.15 0 1,1 0.3,0 a0.15,0.15 0 1,1 -0.3,0z"
     fill="rgb(255,255,255)"
     shaper:cutDepth="0"
     shaper:pathType="interior"
     stroke="rgb(0,0,0)"
     transform="matrix(1,0,0,-1,26.6121177,78.5)"
     vector-effect="non-scaling-stroke"
     id="path94"
     style="stroke:#ff0000" /><path
     d="M-6.6050455,42.9372201 a0.15,0.15 0 1,1 0.3,0 a0.15,0.15 0 1,1 -0.3,0z"
     fill="rgb(255,255,255)"
     shaper:cutDepth="0"
     shaper:pathType="interior"
     stroke="rgb(0,0,0)"
     transform="matrix(1,0,0,-1,26.6121177,78.5)"
     vector-effect="non-scaling-stroke"
     id="path96"
     style="stroke:#ff0000" /><path
     d="M-4.3854816,48.2957214 a0.15,0.15 0 1,1 0.3,0 a0.15,0.15 0 1,1 -0.3,0z"
     fill="rgb(255,255,255)"
     shaper:cutDepth="0"
     shaper:pathType="interior"
     stroke="rgb(0,0,0)"
     transform="matrix(1,0,0,-1,26.6121177,78.5)"
     vector-effect="non-scaling-stroke"
     id="path98"
     style="stroke:#ff0000" /><path
     d="M3.1197897,27.9221276 a0.15,0.15 0 1,1 0.3,0 a0.15,0.15 0 1,1 -0.3,0z"
     fill="rgb(255,255,255)"
     shaper:cutDepth="0"
     shaper:pathType="interior"
     stroke="rgb(0,0,0)"
     transform="matrix(1,0,0,-1,26.6121177,78.5)"
     vector-effect="non-scaling-stroke"
     id="path100"
     style="stroke:#ff0000" /><path
     d="M6.9691277,14.6378438 a0.15,0.15 0 1,1 0.3,0 a0.15,0.15 0 1,1 -0.3,0z"
     fill="rgb(255,255,255)"
     shaper:cutDepth="0"
     shaper:pathType="interior"
     stroke="rgb(0,0,0)"
     transform="matrix(1,0,0,-1,26.6121177,78.5)"
     vector-effect="non-scaling-stroke"
     id="path102"
     style="stroke:#ff0000" /><path
     d="M11.1021088,24.6157428 a0.15,0.15 0 1,1 0.3,0 a0.15,0.15 0 1,1 -0.3,0z"
     fill="rgb(255,255,255)"
     shaper:cutDepth="0"
     shaper:pathType="interior"
     stroke="rgb(0,0,0)"
     transform="matrix(1,0,0,-1,26.6121177,78.5)"
     vector-effect="non-scaling-stroke"
     id="path104"
     style="stroke:#ff0000" /><path
     d="M-1.0131914,17.9442287 a0.15,0.15 0 1,1 0.3,0 a0.15,0.15 0 1,1 -0.3,0z"
     fill="rgb(255,255,255)"
     shaper:cutDepth="0"
     shaper:pathType="interior"
     stroke="rgb(0,0,0)"
     transform="matrix(1,0,0,-1,26.6121177,78.5)"
     vector-effect="non-scaling-stroke"
     id="path106"
     style="stroke:#ff0000" /><path
     d="M26.3825306,20.1227616 a0.15,0.15 0 1,1 0.3,0 a0.15,0.15 0 1,1 -0.3,0z"
     fill="rgb(255,255,255)"
     shaper:cutDepth="0"
     shaper:pathType="interior"
     stroke="rgb(0,0,0)"
     transform="matrix(1,0,0,-1,26.6121177,78.5)"
     vector-effect="non-scaling-stroke"
     id="path108"
     style="stroke:#ff0000" /><path
     d="M34.8678119,28.6080429 a0.15,0.15 0 1,1 0.3,0 a0.15,0.15 0 1,1 -0.3,0z"
     fill="rgb(255,255,255)"
     shaper:cutDepth="0"
     shaper:pathType="interior"
     stroke="rgb(0,0,0)"
     transform="matrix(1,0,0,-1,26.6121177,78.5)"
     vector-effect="non-scaling-stroke"
     id="path110"
     style="stroke:#ff0000" /><path
     d="M20.7256763,25.7796158 a0.15,0.15 0 1,1 0.3,0 a0.15,0.15 0 1,1 -0.3,0z"
     fill="rgb(255,255,255)"
     shaper:cutDepth="0"
     shaper:pathType="interior"
     stroke="rgb(0,0,0)"
     transform="matrix(1,0,0,-1,26.6121177,78.5)"
     vector-effect="non-scaling-stroke"
     id="path112"
     style="stroke:#ff0000" /><path
     d="M29.2109577,34.2648972 a0.15,0.15 0 1,1 0.3,0 a0.15,0.15 0 1,1 -0.3,0z"
     fill="rgb(255,255,255)"
     shaper:cutDepth="0"
     shaper:pathType="interior"
     stroke="rgb(0,0,0)"
     transform="matrix(1,0,0,-1,26.6121177,78.5)"
     vector-effect="non-scaling-stroke"
     id="path114"
     style="stroke:#ff0000" /><path
     d="M44.731278,52.6056518 a0.15,0.15 0 1,1 0.3,0 a0.15,0.15 0 1,1 -0.3,0z"
     fill="rgb(255,255,255)"
     shaper:cutDepth="0"
     shaper:pathType="interior"
     stroke="rgb(0,0,0)"
     transform="matrix(1,0,0,-1,26.6121177,78.5)"
     vector-effect="non-scaling-stroke"
     id="path116"
     style="stroke:#ff0000" /><path
     d="M44.731278,25.8943482 a0.15,0.15 0 1,1 0.3,0 a0.15,0.15 0 1,1 -0.3,0z"
     fill="rgb(255,255,255)"
     shaper:cutDepth="0"
     shaper:pathType="interior"
     stroke="rgb(0,0,0)"
     transform="matrix(1,0,0,-1,26.6121177,78.5)"
     vector-effect="non-scaling-stroke"
     id="path118"
     style="stroke:#ff0000" /><path
     d="M25.8435341,7.0066043 a0.15,0.15 0 1,1 0.3,0 a0.15,0.15 0 1,1 -0.3,0z"
     fill="rgb(255,255,255)"
     shaper:cutDepth="0"
     shaper:pathType="interior"
     stroke="rgb(0,0,0)"
     transform="matrix(1,0,0,-1,26.6121177,78.5)"
     vector-effect="non-scaling-stroke"
     id="path120"
     style="stroke:#ff0000" /><path
     d="M-0.8677695,7.0066043 a0.15,0.15 0 1,1 0.3,0 a0.15,0.15 0 1,1 -0.3,0z"
     fill="rgb(255,255,255)"
     shaper:cutDepth="0"
     shaper:pathType="interior"
     stroke="rgb(0,0,0)"
     transform="matrix(1,0,0,-1,26.6121177,78.5)"
     vector-effect="non-scaling-stroke"
     id="path122"
     style="stroke:#ff0000" /><path
     d="M-19.7555134,25.8943482 a0.15,0.15 0 1,1 0.3,0 a0.15,0.15 0 1,1 -0.3,0z"
     fill="rgb(255,255,255)"
     shaper:cutDepth="0"
     shaper:pathType="interior"
     stroke="rgb(0,0,0)"
     transform="matrix(1,0,0,-1,26.6121177,78.5)"
     vector-effect="non-scaling-stroke"
     id="path124"
     style="stroke:#ff0000" /><path
     d="M-19.7555134,52.6056518 a0.15,0.15 0 1,1 0.3,0 a0.15,0.15 0 1,1 -0.3,0z"
     fill="rgb(255,255,255)"
     shaper:cutDepth="0"
     shaper:pathType="interior"
     stroke="rgb(0,0,0)"
     transform="matrix(1,0,0,-1,26.6121177,78.5)"
     vector-effect="non-scaling-stroke"
     id="path126"
     style="stroke:#ff0000" /><path
     d="M-0.8677695,71.4933957 a0.15,0.15 0 1,1 0.3,0 a0.15,0.15 0 1,1 -0.3,0z"
     fill="rgb(255,255,255)"
     shaper:cutDepth="0"
     shaper:pathType="interior"
     stroke="rgb(0,0,0)"
     transform="matrix(1,0,0,-1,26.6121177,78.5)"
     vector-effect="non-scaling-stroke"
     id="path128"
     style="stroke:#ff0000" /><path
     d="M25.8435341,71.4933957 a0.15,0.15 0 1,1 0.3,0 a0.15,0.15 0 1,1 -0.3,0z"
     fill="rgb(255,255,255)"
     shaper:cutDepth="0"
     shaper:pathType="interior"
     stroke="rgb(0,0,0)"
     transform="matrix(1,0,0,-1,26.6121177,78.5)"
     vector-effect="non-scaling-stroke"
     id="path130"
     style="stroke:#ff0000" /><path
     d="M49.2582877,24.0191994 a0.15,0.15 0 1,1 0.3,0 a0.15,0.15 0 1,1 -0.3,0z"
     fill="rgb(255,255,255)"
     shaper:cutDepth="0"
     shaper:pathType="interior"
     stroke="rgb(0,0,0)"
     transform="matrix(1,0,0,-1,26.6121177,78.5)"
     vector-effect="non-scaling-stroke"
     id="path132"
     style="stroke:#ff0000" /><path
     d="M27.7186829,2.4795946 a0.15,0.15 0 1,1 0.3,0 a0.15,0.15 0 1,1 -0.3,0z"
     fill="rgb(255,255,255)"
     shaper:cutDepth="0"
     shaper:pathType="interior"
     stroke="rgb(0,0,0)"
     transform="matrix(1,0,0,-1,26.6121177,78.5)"
     vector-effect="non-scaling-stroke"
     id="path134"
     style="stroke:#ff0000" /><path
     d="M-2.7429183,2.4795946 a0.15,0.15 0 1,1 0.3,0 a0.15,0.15 0 1,1 -0.3,0z"
     fill="rgb(255,255,255)"
     shaper:cutDepth="0"
     shaper:pathType="interior"
     stroke="rgb(0,0,0)"
     transform="matrix(1,0,0,-1,26.6121177,78.5)"
     vector-effect="non-scaling-stroke"
     id="path136"
     style="stroke:#ff0000" /><path
     d="M-24.2825231,24.0191994 a0.15,0.15 0 1,1 0.3,0 a0.15,0.15 0 1,1 -0.3,0z"
     fill="rgb(255,255,255)"
     shaper:cutDepth="0"
     shaper:pathType="interior"
     stroke="rgb(0,0,0)"
     transform="matrix(1,0,0,-1,26.6121177,78.5)"
     vector-effect="non-scaling-stroke"
     id="path138"
     style="stroke:#ff0000" /><path
     d="M-24.2825231,54.4808006 a0.15,0.15 0 1,1 0.3,0 a0.15,0.15 0 1,1 -0.3,0z"
     fill="rgb(255,255,255)"
     shaper:cutDepth="0"
     shaper:pathType="interior"
     stroke="rgb(0,0,0)"
     transform="matrix(1,0,0,-1,26.6121177,78.5)"
     vector-effect="non-scaling-stroke"
     id="path140"
     style="stroke:#ff0000" /><path
     d="M-2.7429183,76.0204054 a0.15,0.15 0 1,1 0.3,0 a0.15,0.15 0 1,1 -0.3,0z"
     fill="rgb(255,255,255)"
     shaper:cutDepth="0"
     shaper:pathType="interior"
     stroke="rgb(0,0,0)"
     transform="matrix(1,0,0,-1,26.6121177,78.5)"
     vector-effect="non-scaling-stroke"
     id="path142"
     style="stroke:#ff0000" /><path
     d="M27.7186829,76.0204054 a0.15,0.15 0 1,1 0.3,0 a0.15,0.15 0 1,1 -0.3,0z"
     fill="rgb(255,255,255)"
     shaper:cutDepth="0"
     shaper:pathType="interior"
     stroke="rgb(0,0,0)"
     transform="matrix(1,0,0,-1,26.6121177,78.5)"
     vector-effect="non-scaling-stroke"
     id="path144"
     style="stroke:#ff0000" /><path
     d="M49.2582877,54.4808006 a0.15,0.15 0 1,1 0.3,0 a0.15,0.15 0 1,1 -0.3,0z"
     fill="rgb(255,255,255)"
     shaper:cutDepth="0"
     shaper:pathType="interior"
     stroke="rgb(0,0,0)"
     transform="matrix(1,0,0,-1,26.6121177,78.5)"
     vector-effect="non-scaling-stroke"
     id="path146"
     style="stroke:#ff0000" /><path
     d="M-2.8246564,66.3005113 a0.15,0.15 0 1,1 0.3,0 a0.15,0.15 0 1,1 -0.3,0z"
     fill="rgb(255,255,255)"
     shaper:cutDepth="0"
     shaper:pathType="interior"
     stroke="rgb(0,0,0)"
     transform="matrix(1,0,0,-1,26.6121177,78.5)"
     vector-effect="non-scaling-stroke"
     id="path148"
     style="stroke:#ff0000" /><path
     d="M20.7878823,69.2052 a0.15,0.15 0 1,1 0.3,0 a0.15,0.15 0 1,1 -0.3,0z"
     fill="rgb(255,255,255)"
     shaper:cutDepth="0"
     shaper:pathType="interior"
     stroke="rgb(0,0,0)"
     transform="matrix(1,0,0,-1,26.6121177,78.5)"
     vector-effect="non-scaling-stroke"
     id="path150"
     style="stroke:#ff0000" /><path
     d="M39.5383937,54.5625388 a0.15,0.15 0 1,1 0.3,0 a0.15,0.15 0 1,1 -0.3,0z"
     fill="rgb(255,255,255)"
     shaper:cutDepth="0"
     shaper:pathType="interior"
     stroke="rgb(0,0,0)"
     transform="matrix(1,0,0,-1,26.6121177,78.5)"
     vector-effect="non-scaling-stroke"
     id="path152"
     style="stroke:#ff0000" /><path
     d="M42.4430823,30.95 a0.15,0.15 0 1,1 0.3,0 a0.15,0.15 0 1,1 -0.3,0z"
     fill="rgb(255,255,255)"
     shaper:cutDepth="0"
     shaper:pathType="interior"
     stroke="rgb(0,0,0)"
     transform="matrix(1,0,0,-1,26.6121177,78.5)"
     vector-effect="non-scaling-stroke"
     id="path154"
     style="stroke:#ff0000" /><path
     d="M27.8004211,12.1994887 a0.15,0.15 0 1,1 0.3,0 a0.15,0.15 0 1,1 -0.3,0z"
     fill="rgb(255,255,255)"
     shaper:cutDepth="0"
     shaper:pathType="interior"
     stroke="rgb(0,0,0)"
     transform="matrix(1,0,0,-1,26.6121177,78.5)"
     vector-effect="non-scaling-stroke"
     id="path156"
     style="stroke:#ff0000" /><path
     d="M4.1878823,9.2948 a0.15,0.15 0 1,1 0.3,0 a0.15,0.15 0 1,1 -0.3,0z"
     fill="rgb(255,255,255)"
     shaper:cutDepth="0"
     shaper:pathType="interior"
     stroke="rgb(0,0,0)"
     transform="matrix(1,0,0,-1,26.6121177,78.5)"
     vector-effect="non-scaling-stroke"
     id="path158"
     style="stroke:#ff0000" /><path
     d="M-14.562629,23.9374612 a0.15,0.15 0 1,1 0.3,0 a0.15,0.15 0 1,1 -0.3,0z"
     fill="rgb(255,255,255)"
     shaper:cutDepth="0"
     shaper:pathType="interior"
     stroke="rgb(0,0,0)"
     transform="matrix(1,0,0,-1,26.6121177,78.5)"
     vector-effect="non-scaling-stroke"
     id="path160"
     style="stroke:#ff0000" /><path
     d="M-14.562629,54.5625388 a0.15,0.15 0 1,1 0.3,0 a0.15,0.15 0 1,1 -0.3,0z"
     fill="rgb(255,255,255)"
     shaper:cutDepth="0"
     shaper:pathType="interior"
     stroke="rgb(0,0,0)"
     transform="matrix(1,0,0,-1,26.6121177,78.5)"
     vector-effect="non-scaling-stroke"
     id="path162"
     style="stroke:#ff0000" /><path
     d="M4.1878823,69.2052 a0.15,0.15 0 1,1 0.3,0 a0.15,0.15 0 1,1 -0.3,0z"
     fill="rgb(255,255,255)"
     shaper:cutDepth="0"
     shaper:pathType="interior"
     stroke="rgb(0,0,0)"
     transform="matrix(1,0,0,-1,26.6121177,78.5)"
     vector-effect="non-scaling-stroke"
     id="path164"
     style="stroke:#ff0000" /><path
     d="M27.8004211,66.3005113 a0.15,0.15 0 1,1 0.3,0 a0.15,0.15 0 1,1 -0.3,0z"
     fill="rgb(255,255,255)"
     shaper:cutDepth="0"
     shaper:pathType="interior"
     stroke="rgb(0,0,0)"
     transform="matrix(1,0,0,-1,26.6121177,78.5)"
     vector-effect="non-scaling-stroke"
     id="path166"
     style="stroke:#ff0000" /><path
     d="M42.4430823,47.55 a0.15,0.15 0 1,1 0.3,0 a0.15,0.15 0 1,1 -0.3,0z"
     fill="rgb(255,255,255)"
     shaper:cutDepth="0"
     shaper:pathType="interior"
     stroke="rgb(0,0,0)"
     transform="matrix(1,0,0,-1,26.6121177,78.5)"
     vector-effect="non-scaling-stroke"
     id="path168"
     style="stroke:#ff0000" /><path
     d="M39.5383937,23.9374612 a0.15,0.15 0 1,1 0.3,0 a0.15,0.15 0 1,1 -0.3,0z"
     fill="rgb(255,255,255)"
     shaper:cutDepth="0"
     shaper:pathType="interior"
     stroke="rgb(0,0,0)"
     transform="matrix(1,0,0,-1,26.6121177,78.5)"
     vector-effect="non-scaling-stroke"
     id="path170"
     style="stroke:#ff0000" /><path
     d="M20.7878823,9.2948 a0.15,0.15 0 1,1 0.3,0 a0.15,0.15 0 1,1 -0.3,0z"
     fill="rgb(255,255,255)"
     shaper:cutDepth="0"
     shaper:pathType="interior"
     stroke="rgb(0,0,0)"
     transform="matrix(1,0,0,-1,26.6121177,78.5)"
     vector-effect="non-scaling-stroke"
     id="path172"
     style="stroke:#ff0000" /><path
     d="M-2.8246564,12.1994887 a0.15,0.15 0 1,1 0.3,0 a0.15,0.15 0 1,1 -0.3,0z"
     fill="rgb(255,255,255)"
     shaper:cutDepth="0"
     shaper:pathType="interior"
     stroke="rgb(0,0,0)"
     transform="matrix(1,0,0,-1,26.6121177,78.5)"
     vector-effect="non-scaling-stroke"
     id="path174"
     style="stroke:#ff0000" /><path
     d="M-5.6530836,63.4720842 a0.15,0.15 0 1,1 0.3,0 a0.15,0.15 0 1,1 -0.3,0z"
     fill="rgb(255,255,255)"
     shaper:cutDepth="0"
     shaper:pathType="interior"
     stroke="rgb(0,0,0)"
     transform="matrix(1,0,0,-1,26.6121177,78.5)"
     vector-effect="non-scaling-stroke"
     id="path176"
     style="stroke:#ff0000" /><path
     d="M16.7878823,69.2052 a0.15,0.15 0 1,1 0.3,0 a0.15,0.15 0 1,1 -0.3,0z"
     fill="rgb(255,255,255)"
     shaper:cutDepth="0"
     shaper:pathType="interior"
     stroke="rgb(0,0,0)"
     transform="matrix(1,0,0,-1,26.6121177,78.5)"
     vector-effect="non-scaling-stroke"
     id="path178"
     style="stroke:#ff0000" /><path
     d="M36.7099665,57.3909659 a0.15,0.15 0 1,1 0.3,0 a0.15,0.15 0 1,1 -0.3,0z"
     fill="rgb(255,255,255)"
     shaper:cutDepth="0"
     shaper:pathType="interior"
     stroke="rgb(0,0,0)"
     transform="matrix(1,0,0,-1,26.6121177,78.5)"
     vector-effect="non-scaling-stroke"
     id="path180"
     style="stroke:#ff0000" /><path
     d="M42.4430823,34.95 a0.15,0.15 0 1,1 0.3,0 a0.15,0.15 0 1,1 -0.3,0z"
     fill="rgb(255,255,255)"
     shaper:cutDepth="0"
     shaper:pathType="interior"
     stroke="rgb(0,0,0)"
     transform="matrix(1,0,0,-1,26.6121177,78.5)"
     vector-effect="non-scaling-stroke"
     id="path182"
     style="stroke:#ff0000" /><path
     d="M30.6288482,15.0279158 a0.15,0.15 0 1,1 0.3,0 a0.15,0.15 0 1,1 -0.3,0z"
     fill="rgb(255,255,255)"
     shaper:cutDepth="0"
     shaper:pathType="interior"
     stroke="rgb(0,0,0)"
     transform="matrix(1,0,0,-1,26.6121177,78.5)"
     vector-effect="non-scaling-stroke"
     id="path184"
     style="stroke:#ff0000" /><path
     d="M8.1878823,9.2948 a0.15,0.15 0 1,1 0.3,0 a0.15,0.15 0 1,1 -0.3,0z"
     fill="rgb(255,255,255)"
     shaper:cutDepth="0"
     shaper:pathType="interior"
     stroke="rgb(0,0,0)"
     transform="matrix(1,0,0,-1,26.6121177,78.5)"
     vector-effect="non-scaling-stroke"
     id="path186"
     style="stroke:#ff0000" /><path
     d="M-11.7342019,21.1090341 a0.15,0.15 0 1,1 0.3,0 a0.15,0.15 0 1,1 -0.3,0z"
     fill="rgb(255,255,255)"
     shaper:cutDepth="0"
     shaper:pathType="interior"
     stroke="rgb(0,0,0)"
     transform="matrix(1,0,0,-1,26.6121177,78.5)"
     vector-effect="non-scaling-stroke"
     id="path188"
     style="stroke:#ff0000" /><path
     d="M-11.7342019,57.3909659 a0.15,0.15 0 1,1 0.3,0 a0.15,0.15 0 1,1 -0.3,0z"
     fill="rgb(255,255,255)"
     shaper:cutDepth="0"
     shaper:pathType="interior"
     stroke="rgb(0,0,0)"
     transform="matrix(1,0,0,-1,26.6121177,78.5)"
     vector-effect="non-scaling-stroke"
     id="path190"
     style="stroke:#ff0000" /><path
     d="M8.1878823,69.2052 a0.15,0.15 0 1,1 0.3,0 a0.15,0.15 0 1,1 -0.3,0z"
     fill="rgb(255,255,255)"
     shaper:cutDepth="0"
     shaper:pathType="interior"
     stroke="rgb(0,0,0)"
     transform="matrix(1,0,0,-1,26.6121177,78.5)"
     vector-effect="non-scaling-stroke"
     id="path192"
     style="stroke:#ff0000" /><path
     d="M30.6288482,63.4720842 a0.15,0.15 0 1,1 0.3,0 a0.15,0.15 0 1,1 -0.3,0z"
     fill="rgb(255,255,255)"
     shaper:cutDepth="0"
     shaper:pathType="interior"
     stroke="rgb(0,0,0)"
     transform="matrix(1,0,0,-1,26.6121177,78.5)"
     vector-effect="non-scaling-stroke"
     id="path194"
     style="stroke:#ff0000" /><path
     d="M42.4430823,43.55 a0.15,0.15 0 1,1 0.3,0 a0.15,0.15 0 1,1 -0.3,0z"
     fill="rgb(255,255,255)"
     shaper:cutDepth="0"
     shaper:pathType="interior"
     stroke="rgb(0,0,0)"
     transform="matrix(1,0,0,-1,26.6121177,78.5)"
     vector-effect="non-scaling-stroke"
     id="path196"
     style="stroke:#ff0000" /><path
     d="M36.7099665,21.1090341 a0.15,0.15 0 1,1 0.3,0 a0.15,0.15 0 1,1 -0.3,0z"
     fill="rgb(255,255,255)"
     shaper:cutDepth="0"
     shaper:pathType="interior"
     stroke="rgb(0,0,0)"
     transform="matrix(1,0,0,-1,26.6121177,78.5)"
     vector-effect="non-scaling-stroke"
     id="path198"
     style="stroke:#ff0000" /><path
     d="M16.7878823,9.2948 a0.15,0.15 0 1,1 0.3,0 a0.15,0.15 0 1,1 -0.3,0z"
     fill="rgb(255,255,255)"
     shaper:cutDepth="0"
     shaper:pathType="interior"
     stroke="rgb(0,0,0)"
     transform="matrix(1,0,0,-1,26.6121177,78.5)"
     vector-effect="non-scaling-stroke"
     id="path200"
     style="stroke:#ff0000" /><path
     d="M-5.6530836,15.0279158 a0.15,0.15 0 1,1 0.3,0 a0.15,0.15 0 1,1 -0.3,0z"
     fill="rgb(255,255,255)"
     shaper:cutDepth="0"
     shaper:pathType="interior"
     stroke="rgb(0,0,0)"
     transform="matrix(1,0,0,-1,26.6121177,78.5)"
     vector-effect="non-scaling-stroke"
     id="path202"
     style="stroke:#ff0000" /><path
     d="M-17.4673177,43.55 a0.15,0.15 0 1,1 0.3,0 a0.15,0.15 0 1,1 -0.3,0z"
     fill="rgb(255,255,255)"
     shaper:cutDepth="0"
     shaper:pathType="interior"
     stroke="rgb(0,0,0)"
     transform="matrix(1,0,0,-1,26.6121177,78.5)"
     vector-effect="non-scaling-stroke"
     id="path204"
     style="stroke:#ff0000" /><path
     d="M-17.4673177,30.95 a0.15,0.15 0 1,1 0.3,0 a0.15,0.15 0 1,1 -0.3,0z"
     fill="rgb(255,255,255)"
     shaper:cutDepth="0"
     shaper:pathType="interior"
     stroke="rgb(0,0,0)"
     transform="matrix(1,0,0,-1,26.6121177,78.5)"
     vector-effect="non-scaling-stroke"
     id="path206"
     style="stroke:#ff0000" /><path
     d="M-17.4673177,47.55 a0.15,0.15 0 1,1 0.3,0 a0.15,0.15 0 1,1 -0.3,0z"
     fill="rgb(255,255,255)"
     shaper:cutDepth="0"
     shaper:pathType="interior"
     stroke="rgb(0,0,0)"
     transform="matrix(1,0,0,-1,26.6121177,78.5)"
     vector-effect="non-scaling-stroke"
     id="path208"
     style="stroke:#ff0000" /><path
     d="M-17.4673177,34.95 a0.15,0.15 0 1,1 0.3,0 a0.15,0.15 0 1,1 -0.3,0z"
     fill="rgb(255,255,255)"
     shaper:cutDepth="0"
     shaper:pathType="interior"
     stroke="rgb(0,0,0)"
     transform="matrix(1,0,0,-1,26.6121177,78.5)"
     vector-effect="non-scaling-stroke"
     id="path210"
     style="stroke:#ff0000" /><path
     d="M23.7183853,66.966386 a0.4,0.4 0 1,1 0.8,0 a0.4,0.4 0 1,1 -0.8,0z"
     fill="rgb(255,255,255)"
     shaper:cutDepth="0"
     shaper:pathType="interior"
     stroke="rgb(0,0,0)"
     transform="matrix(1,0,0,-1,26.6121177,78.5)"
     vector-effect="non-scaling-stroke"
     id="path212"
     style="stroke:#ff0000" /><path
     d="M39.9542683,50.730503 a0.4,0.4 0 1,1 0.8,0 a0.4,0.4 0 1,1 -0.8,0z"
     fill="rgb(255,255,255)"
     shaper:cutDepth="0"
     shaper:pathType="interior"
     stroke="rgb(0,0,0)"
     transform="matrix(1,0,0,-1,26.6121177,78.5)"
     vector-effect="non-scaling-stroke"
     id="path214"
     style="stroke:#ff0000" /><path
     d="M39.9542683,27.769497 a0.4,0.4 0 1,1 0.8,0 a0.4,0.4 0 1,1 -0.8,0z"
     fill="rgb(255,255,255)"
     shaper:cutDepth="0"
     shaper:pathType="interior"
     stroke="rgb(0,0,0)"
     transform="matrix(1,0,0,-1,26.6121177,78.5)"
     vector-effect="non-scaling-stroke"
     id="path216"
     style="stroke:#ff0000" /><path
     d="M23.7183853,11.533614 a0.4,0.4 0 1,1 0.8,0 a0.4,0.4 0 1,1 -0.8,0z"
     fill="rgb(255,255,255)"
     shaper:cutDepth="0"
     shaper:pathType="interior"
     stroke="rgb(0,0,0)"
     transform="matrix(1,0,0,-1,26.6121177,78.5)"
     vector-effect="non-scaling-stroke"
     id="path218"
     style="stroke:#ff0000" /><path
     d="M0.7573794,11.533614 a0.4,0.4 0 1,1 0.8,0 a0.4,0.4 0 1,1 -0.8,0z"
     fill="rgb(255,255,255)"
     shaper:cutDepth="0"
     shaper:pathType="interior"
     stroke="rgb(0,0,0)"
     transform="matrix(1,0,0,-1,26.6121177,78.5)"
     vector-effect="non-scaling-stroke"
     id="path220"
     style="stroke:#ff0000" /><path
     d="M-15.4785037,27.769497 a0.4,0.4 0 1,1 0.8,0 a0.4,0.4 0 1,1 -0.8,0z"
     fill="rgb(255,255,255)"
     shaper:cutDepth="0"
     shaper:pathType="interior"
     stroke="rgb(0,0,0)"
     transform="matrix(1,0,0,-1,26.6121177,78.5)"
     vector-effect="non-scaling-stroke"
     id="path222"
     style="stroke:#ff0000" /><path
     d="M-15.4785037,50.730503 a0.4,0.4 0 1,1 0.8,0 a0.4,0.4 0 1,1 -0.8,0z"
     fill="rgb(255,255,255)"
     shaper:cutDepth="0"
     shaper:pathType="interior"
     stroke="rgb(0,0,0)"
     transform="matrix(1,0,0,-1,26.6121177,78.5)"
     vector-effect="non-scaling-stroke"
     id="path224"
     style="stroke:#ff0000" /><path
     d="M16.8300835,50.3365544 a0.4,0.4 0 1,1 0.8,0 a0.4,0.4 0 1,1 -0.8,0z"
     fill="rgb(255,255,255)"
     shaper:cutDepth="0"
     shaper:pathType="interior"
     stroke="rgb(0,0,0)"
     transform="matrix(1,0,0,-1,26.6121177,78.5)"
     vector-effect="non-scaling-stroke"
     id="path226"
     style="stroke:#ff0000" /><path
     d="M23.3244367,43.8422012 a0.4,0.4 0 1,1 0.8,0 a0.4,0.4 0 1,1 -0.8,0z"
     fill="rgb(255,255,255)"
     shaper:cutDepth="0"
     shaper:pathType="interior"
     stroke="rgb(0,0,0)"
     transform="matrix(1,0,0,-1,26.6121177,78.5)"
     vector-effect="non-scaling-stroke"
     id="path228"
     style="stroke:#ff0000" /><path
     d="M23.3244367,34.6577988 a0.4,0.4 0 1,1 0.8,0 a0.4,0.4 0 1,1 -0.8,0z"
     fill="rgb(255,255,255)"
     shaper:cutDepth="0"
     shaper:pathType="interior"
     stroke="rgb(0,0,0)"
     transform="matrix(1,0,0,-1,26.6121177,78.5)"
     vector-effect="non-scaling-stroke"
     id="path230"
     style="stroke:#ff0000" /><path
     d="M16.8300835,28.1634456 a0.4,0.4 0 1,1 0.8,0 a0.4,0.4 0 1,1 -0.8,0z"
     fill="rgb(255,255,255)"
     shaper:cutDepth="0"
     shaper:pathType="interior"
     stroke="rgb(0,0,0)"
     transform="matrix(1,0,0,-1,26.6121177,78.5)"
     vector-effect="non-scaling-stroke"
     id="path232"
     style="stroke:#ff0000" /><path
     d="M7.6456811,28.1634456 a0.4,0.4 0 1,1 0.8,0 a0.4,0.4 0 1,1 -0.8,0z"
     fill="rgb(255,255,255)"
     shaper:cutDepth="0"
     shaper:pathType="interior"
     stroke="rgb(0,0,0)"
     transform="matrix(1,0,0,-1,26.6121177,78.5)"
     vector-effect="non-scaling-stroke"
     id="path234"
     style="stroke:#ff0000" /><path
     d="M1.1513279,34.6577988 a0.4,0.4 0 1,1 0.8,0 a0.4,0.4 0 1,1 -0.8,0z"
     fill="rgb(255,255,255)"
     shaper:cutDepth="0"
     shaper:pathType="interior"
     stroke="rgb(0,0,0)"
     transform="matrix(1,0,0,-1,26.6121177,78.5)"
     vector-effect="non-scaling-stroke"
     id="path236"
     style="stroke:#ff0000" /><path
     d="M1.1513279,43.8422012 a0.4,0.4 0 1,1 0.8,0 a0.4,0.4 0 1,1 -0.8,0z"
     fill="rgb(255,255,255)"
     shaper:cutDepth="0"
     shaper:pathType="interior"
     stroke="rgb(0,0,0)"
     transform="matrix(1,0,0,-1,26.6121177,78.5)"
     vector-effect="non-scaling-stroke"
     id="path238"
     style="stroke:#ff0000" /><path
     d="M0.7573794,66.966386 a0.4,0.4 0 1,1 0.8,0 a0.4,0.4 0 1,1 -0.8,0z"
     fill="rgb(255,255,255)"
     shaper:cutDepth="0"
     shaper:pathType="interior"
     stroke="rgb(0,0,0)"
     transform="matrix(1,0,0,-1,26.6121177,78.5)"
     vector-effect="non-scaling-stroke"
     id="path240"
     style="stroke:#ff0000" /><path
     d="M7.6456811,50.3365544 a0.4,0.4 0 1,1 0.8,0 a0.4,0.4 0 1,1 -0.8,0z"
     fill="rgb(255,255,255)"
     shaper:cutDepth="0"
     shaper:pathType="interior"
     stroke="rgb(0,0,0)"
     transform="matrix(1,0,0,-1,26.6121177,78.5)"
     vector-effect="non-scaling-stroke"
     id="path242"
     style="stroke:#ff0000" /><path
     d="M9.8004274,53.1113253 a0.14,0.14 0 1,1 0.28,0 a0.14,0.14 0 1,1 -0.28,0z"
     fill="rgb(255,255,255)"
     shaper:cutDepth="0"
     shaper:pathType="interior"
     stroke="rgb(0,0,0)"
     transform="matrix(1,0,0,-1,26.6121177,78.5)"
     vector-effect="non-scaling-stroke"
     id="path244"
     style="stroke:#ff0000" /><path
     d="M-0.5968382,51.5052839 a0.14,0.14 0 1,1 0.28,0 a0.14,0.14 0 1,1 -0.28,0z"
     fill="rgb(255,255,255)"
     shaper:cutDepth="0"
     shaper:pathType="interior"
     stroke="rgb(0,0,0)"
     transform="matrix(1,0,0,-1,26.6121177,78.5)"
     vector-effect="non-scaling-stroke"
     id="path246"
     style="stroke:#ff0000" /><path
     d="M-6.3709804,45.4735526 a0.14,0.14 0 1,1 0.28,0 a0.14,0.14 0 1,1 -0.28,0z"
     fill="rgb(255,255,255)"
     shaper:cutDepth="0"
     shaper:pathType="interior"
     stroke="rgb(0,0,0)"
     transform="matrix(1,0,0,-1,26.6121177,78.5)"
     vector-effect="non-scaling-stroke"
     id="path248"
     style="stroke:#ff0000" /><path
     d="M5.177304,57.5370151 a0.14,0.14 0 1,1 0.28,0 a0.14,0.14 0 1,1 -0.28,0z"
     fill="rgb(255,255,255)"
     shaper:cutDepth="0"
     shaper:pathType="interior"
     stroke="rgb(0,0,0)"
     transform="matrix(1,0,0,-1,26.6121177,78.5)"
     vector-effect="non-scaling-stroke"
     id="path250"
     style="stroke:#ff0000" /><path
     d="M4.0262852,47.0795941 a0.14,0.14 0 1,1 0.28,0 a0.14,0.14 0 1,1 -0.28,0z"
     fill="rgb(255,255,255)"
     shaper:cutDepth="0"
     shaper:pathType="interior"
     stroke="rgb(0,0,0)"
     transform="matrix(1,0,0,-1,26.6121177,78.5)"
     vector-effect="non-scaling-stroke"
     id="path252"
     style="stroke:#ff0000" /><path
     d="M-1.747857,41.0478628 a0.14,0.14 0 1,1 0.28,0 a0.14,0.14 0 1,1 -0.28,0z"
     fill="rgb(255,255,255)"
     shaper:cutDepth="0"
     shaper:pathType="interior"
     stroke="rgb(0,0,0)"
     transform="matrix(1,0,0,-1,26.6121177,78.5)"
     vector-effect="non-scaling-stroke"
     id="path254"
     style="stroke:#ff0000" /><path
     d="M-9.4819674,40.401391 a0.15,0.15 0 1,1 0.3,0 a0.15,0.15 0 1,1 -0.3,0z"
     fill="rgb(255,255,255)"
     shaper:cutDepth="0"
     shaper:pathType="interior"
     stroke="rgb(0,0,0)"
     transform="matrix(1,0,0,-1,26.6121177,78.5)"
     vector-effect="non-scaling-stroke"
     id="path256"
     style="stroke:#ff0000" /><path
     d="M-6.7537512,28.5841884 a0.15,0.15 0 1,1 0.3,0 a0.15,0.15 0 1,1 -0.3,0z"
     fill="rgb(255,255,255)"
     shaper:cutDepth="0"
     shaper:pathType="interior"
     stroke="rgb(0,0,0)"
     transform="matrix(1,0,0,-1,26.6121177,78.5)"
     vector-effect="non-scaling-stroke"
     id="path258"
     style="stroke:#ff0000" /><path
     d="M-10.8969992,33.8511747 a0.15,0.15 0 1,1 0.3,0 a0.15,0.15 0 1,1 -0.3,0z"
     fill="rgb(255,255,255)"
     shaper:cutDepth="0"
     shaper:pathType="interior"
     stroke="rgb(0,0,0)"
     transform="matrix(1,0,0,-1,26.6121177,78.5)"
     vector-effect="non-scaling-stroke"
     id="path260"
     style="stroke:#ff0000" /><path
     d="M-8.3135263,46.4124994 a0.15,0.15 0 1,1 0.3,0 a0.15,0.15 0 1,1 -0.3,0z"
     fill="rgb(255,255,255)"
     shaper:cutDepth="0"
     shaper:pathType="interior"
     stroke="rgb(0,0,0)"
     transform="matrix(1,0,0,-1,26.6121177,78.5)"
     vector-effect="non-scaling-stroke"
     id="path262"
     style="stroke:#ff0000" /><path
     d="M-11.4792265,40.5060629 a0.15,0.15 0 1,1 0.3,0 a0.15,0.15 0 1,1 -0.3,0z"
     fill="rgb(255,255,255)"
     shaper:cutDepth="0"
     shaper:pathType="interior"
     stroke="rgb(0,0,0)"
     transform="matrix(1,0,0,-1,26.6121177,78.5)"
     vector-effect="non-scaling-stroke"
     id="path264"
     style="stroke:#ff0000" /><path
     d="M-8.5029906,27.6145691 a0.15,0.15 0 1,1 0.3,0 a0.15,0.15 0 1,1 -0.3,0z"
     fill="rgb(255,255,255)"
     shaper:cutDepth="0"
     shaper:pathType="interior"
     stroke="rgb(0,0,0)"
     transform="matrix(1,0,0,-1,26.6121177,78.5)"
     vector-effect="non-scaling-stroke"
     id="path266"
     style="stroke:#ff0000" /><path
     d="M-8.9482591,34.3010768 a0.15,0.15 0 1,1 0.3,0 a0.15,0.15 0 1,1 -0.3,0z"
     fill="rgb(255,255,255)"
     shaper:cutDepth="0"
     shaper:pathType="interior"
     stroke="rgb(0,0,0)"
     transform="matrix(1,0,0,-1,26.6121177,78.5)"
     vector-effect="non-scaling-stroke"
     id="path268"
     style="stroke:#ff0000" /><path
     d="M-10.2045635,47.0636357 a0.15,0.15 0 1,1 0.3,0 a0.15,0.15 0 1,1 -0.3,0z"
     fill="rgb(255,255,255)"
     shaper:cutDepth="0"
     shaper:pathType="interior"
     stroke="rgb(0,0,0)"
     transform="matrix(1,0,0,-1,26.6121177,78.5)"
     vector-effect="non-scaling-stroke"
     id="path270"
     style="stroke:#ff0000" /><path
     d="M-1.9556782,58.4172522 a0.15,0.15 0 1,1 0.3,0 a0.15,0.15 0 1,1 -0.3,0z"
     fill="rgb(255,255,255)"
     shaper:cutDepth="0"
     shaper:pathType="interior"
     stroke="rgb(0,0,0)"
     transform="matrix(1,0,0,-1,26.6121177,78.5)"
     vector-effect="non-scaling-stroke"
     id="path272"
     style="stroke:#ff0000" /><path
     d="M-0.6918667,56.7401177 a0.15,0.15 0 1,1 0.3,0 a0.15,0.15 0 1,1 -0.3,0z"
     fill="rgb(255,255,255)"
     shaper:cutDepth="0"
     shaper:pathType="interior"
     stroke="rgb(0,0,0)"
     transform="matrix(1,0,0,-1,26.6121177,78.5)"
     vector-effect="non-scaling-stroke"
     id="path274"
     style="stroke:#ff0000" /><path
     d="M-3.1709973,53.2896051 a0.15,0.15 0 1,1 0.3,0 a0.15,0.15 0 1,1 -0.3,0z"
     fill="rgb(255,255,255)"
     shaper:cutDepth="0"
     shaper:pathType="interior"
     stroke="rgb(0,0,0)"
     transform="matrix(1,0,0,-1,26.6121177,78.5)"
     vector-effect="non-scaling-stroke"
     id="path276"
     style="stroke:#ff0000" /><path
     d="M-6.0659115,52.2415063 a0.15,0.15 0 1,1 0.3,0 a0.15,0.15 0 1,1 -0.3,0z"
     fill="rgb(255,255,255)"
     shaper:cutDepth="0"
     shaper:pathType="interior"
     stroke="rgb(0,0,0)"
     transform="matrix(1,0,0,-1,26.6121177,78.5)"
     vector-effect="non-scaling-stroke"
     id="path278"
     style="stroke:#ff0000" /><path
     d="M-6.1406987,61.9298003 a0.2,0.2 0 1,1 0.4,0 a0.2,0.2 0 1,1 -0.4,0z"
     fill="rgb(255,255,255)"
     shaper:cutDepth="0"
     shaper:pathType="interior"
     stroke="rgb(0,0,0)"
     transform="matrix(1,0,0,-1,26.6121177,78.5)"
     vector-effect="non-scaling-stroke"
     id="path280"
     style="stroke:#ff0000" /><path
     d="M-10.241918,57.828581 a0.2,0.2 0 1,1 0.4,0 a0.2,0.2 0 1,1 -0.4,0z"
     fill="rgb(255,255,255)"
     shaper:cutDepth="0"
     shaper:pathType="interior"
     stroke="rgb(0,0,0)"
     transform="matrix(1,0,0,-1,26.6121177,78.5)"
     vector-effect="non-scaling-stroke"
     id="path282"
     style="stroke:#ff0000" /><path
     d="M-3.1891775,58.9782792 a0.2,0.2 0 1,1 0.4,0 a0.2,0.2 0 1,1 -0.4,0z"
     fill="rgb(255,255,255)"
     shaper:cutDepth="0"
     shaper:pathType="interior"
     stroke="rgb(0,0,0)"
     transform="matrix(1,0,0,-1,26.6121177,78.5)"
     vector-effect="non-scaling-stroke"
     id="path284"
     style="stroke:#ff0000" /><path
     d="M-6.3711581,55.7962987 a0.2,0.2 0 1,1 0.4,0 a0.2,0.2 0 1,1 -0.4,0z"
     fill="rgb(255,255,255)"
     shaper:cutDepth="0"
     shaper:pathType="interior"
     stroke="rgb(0,0,0)"
     transform="matrix(1,0,0,-1,26.6121177,78.5)"
     vector-effect="non-scaling-stroke"
     id="path286"
     style="stroke:#ff0000" /><path
     d="M2.1878791,61.3726254 a0.15,0.15 0 1,1 0.3,0 a0.15,0.15 0 1,1 -0.3,0z"
     fill="rgb(255,255,255)"
     shaper:cutDepth="0"
     shaper:pathType="interior"
     stroke="rgb(0,0,0)"
     transform="matrix(1,0,0,-1,26.6121177,78.5)"
     vector-effect="non-scaling-stroke"
     id="path288"
     style="stroke:#ff0000" /><path
     d="M4.1280261,62.1762606 a0.15,0.15 0 1,1 0.3,0 a0.15,0.15 0 1,1 -0.3,0z"
     fill="rgb(255,255,255)"
     shaper:cutDepth="0"
     shaper:pathType="interior"
     stroke="rgb(0,0,0)"
     transform="matrix(1,0,0,-1,26.6121177,78.5)"
     vector-effect="non-scaling-stroke"
     id="path290"
     style="stroke:#ff0000" /><path
     d="M17.9925067,18.3300746 a0.15,0.15 0 1,1 0.3,0 a0.15,0.15 0 1,1 -0.3,0z"
     fill="rgb(255,255,255)"
     shaper:cutDepth="0"
     shaper:pathType="interior"
     stroke="rgb(0,0,0)"
     transform="matrix(1,0,0,-1,26.6121177,78.5)"
     vector-effect="non-scaling-stroke"
     id="path292"
     style="stroke:#ff0000" /><path
     d="M13.396774,21.1612135 a0.15,0.15 0 1,1 0.3,0 a0.15,0.15 0 1,1 -0.3,0z"
     fill="rgb(255,255,255)"
     shaper:cutDepth="0"
     shaper:pathType="interior"
     stroke="rgb(0,0,0)"
     transform="matrix(1,0,0,-1,26.6121177,78.5)"
     vector-effect="non-scaling-stroke"
     id="path294"
     style="stroke:#ff0000" /><path
     d="M11.2954681,22.7827315 a0.15,0.15 0 1,1 0.3,0 a0.15,0.15 0 1,1 -0.3,0z"
     fill="rgb(255,255,255)"
     shaper:cutDepth="0"
     shaper:pathType="interior"
     stroke="rgb(0,0,0)"
     transform="matrix(1,0,0,-1,26.6121177,78.5)"
     vector-effect="non-scaling-stroke"
     id="path296"
     style="stroke:#ff0000" /><path
     d="M14.9935385,18.3877095 a0.15,0.15 0 1,1 0.3,0 a0.15,0.15 0 1,1 -0.3,0z"
     fill="rgb(255,255,255)"
     shaper:cutDepth="0"
     shaper:pathType="interior"
     stroke="rgb(0,0,0)"
     transform="matrix(1,0,0,-1,26.6121177,78.5)"
     vector-effect="non-scaling-stroke"
     id="path298"
     style="stroke:#ff0000" /><path
     d="M17.2146892,19.1078921 a0.15,0.15 0 1,1 0.3,0 a0.15,0.15 0 1,1 -0.3,0z"
     fill="rgb(255,255,255)"
     shaper:cutDepth="0"
     shaper:pathType="interior"
     stroke="rgb(0,0,0)"
     transform="matrix(1,0,0,-1,26.6121177,78.5)"
     vector-effect="non-scaling-stroke"
     id="path300"
     style="stroke:#ff0000" /><path
     d="M12.6189566,20.383396 a0.15,0.15 0 1,1 0.3,0 a0.15,0.15 0 1,1 -0.3,0z"
     fill="rgb(255,255,255)"
     shaper:cutDepth="0"
     shaper:pathType="interior"
     stroke="rgb(0,0,0)"
     transform="matrix(1,0,0,-1,26.6121177,78.5)"
     vector-effect="non-scaling-stroke"
     id="path302"
     style="stroke:#ff0000" /><path
     d="M10.8518694,21.776143 a0.15,0.15 0 1,1 0.3,0 a0.15,0.15 0 1,1 -0.3,0z"
     fill="rgb(255,255,255)"
     shaper:cutDepth="0"
     shaper:pathType="interior"
     stroke="rgb(0,0,0)"
     transform="matrix(1,0,0,-1,26.6121177,78.5)"
     vector-effect="non-scaling-stroke"
     id="path304"
     style="stroke:#ff0000" /><path
     d="M15.356949,19.4259449 a0.15,0.15 0 1,1 0.3,0 a0.15,0.15 0 1,1 -0.3,0z"
     fill="rgb(255,255,255)"
     shaper:cutDepth="0"
     shaper:pathType="interior"
     stroke="rgb(0,0,0)"
     transform="matrix(1,0,0,-1,26.6121177,78.5)"
     vector-effect="non-scaling-stroke"
     id="path306"
     style="stroke:#ff0000" /><path
     d="M-0.0159988,19.612587 a0.15,0.15 0 1,1 0.3,0 a0.15,0.15 0 1,1 -0.3,0z"
     fill="rgb(255,255,255)"
     shaper:cutDepth="0"
     shaper:pathType="interior"
     stroke="rgb(0,0,0)"
     transform="matrix(1,0,0,-1,26.6121177,78.5)"
     vector-effect="non-scaling-stroke"
     id="path308"
     style="stroke:#ff0000" /><path
     d="M5.4037019,15.9544194 a0.15,0.15 0 1,1 0.3,0 a0.15,0.15 0 1,1 -0.3,0z"
     fill="rgb(255,255,255)"
     shaper:cutDepth="0"
     shaper:pathType="interior"
     stroke="rgb(0,0,0)"
     transform="matrix(1,0,0,-1,26.6121177,78.5)"
     vector-effect="non-scaling-stroke"
     id="path310"
     style="stroke:#ff0000" /><path
     d="M2.5818988,18.6065404 a0.15,0.15 0 1,1 0.3,0 a0.15,0.15 0 1,1 -0.3,0z"
     fill="rgb(255,255,255)"
     shaper:cutDepth="0"
     shaper:pathType="interior"
     stroke="rgb(0,0,0)"
     transform="matrix(1,0,0,-1,26.6121177,78.5)"
     vector-effect="non-scaling-stroke"
     id="path312"
     style="stroke:#ff0000" /><path
     d="M0.404953,20.6288545 a0.15,0.15 0 1,1 0.3,0 a0.15,0.15 0 1,1 -0.3,0z"
     fill="rgb(255,255,255)"
     shaper:cutDepth="0"
     shaper:pathType="interior"
     stroke="rgb(0,0,0)"
     transform="matrix(1,0,0,-1,26.6121177,78.5)"
     vector-effect="non-scaling-stroke"
     id="path314"
     style="stroke:#ff0000" /><path
     d="M4.3874344,16.3753712 a0.15,0.15 0 1,1 0.3,0 a0.15,0.15 0 1,1 -0.3,0z"
     fill="rgb(255,255,255)"
     shaper:cutDepth="0"
     shaper:pathType="interior"
     stroke="rgb(0,0,0)"
     transform="matrix(1,0,0,-1,26.6121177,78.5)"
     vector-effect="non-scaling-stroke"
     id="path316"
     style="stroke:#ff0000" /><path
     d="M3.0028506,19.6228079 a0.15,0.15 0 1,1 0.3,0 a0.15,0.15 0 1,1 -0.3,0z"
     fill="rgb(255,255,255)"
     shaper:cutDepth="0"
     shaper:pathType="interior"
     stroke="rgb(0,0,0)"
     transform="matrix(1,0,0,-1,26.6121177,78.5)"
     vector-effect="non-scaling-stroke"
     id="path318"
     style="stroke:#ff0000" /><path
     d="M-3.1478664,27.16286 a0.15,0.15 0 1,1 0.3,0 a0.15,0.15 0 1,1 -0.3,0z"
     fill="rgb(255,255,255)"
     shaper:cutDepth="0"
     shaper:pathType="interior"
     stroke="rgb(0,0,0)"
     transform="matrix(1,0,0,-1,26.6121177,78.5)"
     vector-effect="non-scaling-stroke"
     id="path320"
     style="stroke:#ff0000" /><path
     d="M-2.6886463,28.2715154 a0.15,0.15 0 1,1 0.3,0 a0.15,0.15 0 1,1 -0.3,0z"
     fill="rgb(255,255,255)"
     shaper:cutDepth="0"
     shaper:pathType="interior"
     stroke="rgb(0,0,0)"
     transform="matrix(1,0,0,-1,26.6121177,78.5)"
     vector-effect="non-scaling-stroke"
     id="path322"
     style="stroke:#ff0000" /><path
     d="M-4.1644824,22.5976353 a0.15,0.15 0 1,1 0.3,0 a0.15,0.15 0 1,1 -0.3,0z"
     fill="rgb(255,255,255)"
     shaper:cutDepth="0"
     shaper:pathType="interior"
     stroke="rgb(0,0,0)"
     transform="matrix(1,0,0,-1,26.6121177,78.5)"
     vector-effect="non-scaling-stroke"
     id="path324"
     style="stroke:#ff0000" /><path
     d="M-3.3866649,23.3754528 a0.15,0.15 0 1,1 0.3,0 a0.15,0.15 0 1,1 -0.3,0z"
     fill="rgb(255,255,255)"
     shaper:cutDepth="0"
     shaper:pathType="interior"
     stroke="rgb(0,0,0)"
     transform="matrix(1,0,0,-1,26.6121177,78.5)"
     vector-effect="non-scaling-stroke"
     id="path326"
     style="stroke:#ff0000" /><path
     d="M-9.5629239,51.3262745 a0.15,0.15 0 1,1 0.3,0 a0.15,0.15 0 1,1 -0.3,0z"
     fill="rgb(255,255,255)"
     shaper:cutDepth="0"
     shaper:pathType="interior"
     stroke="rgb(0,0,0)"
     transform="matrix(1,0,0,-1,26.6121177,78.5)"
     vector-effect="non-scaling-stroke"
     id="path328"
     style="stroke:#ff0000" /><path
     d="M-11.043083,51.9338344 a0.15,0.15 0 1,1 0.3,0 a0.15,0.15 0 1,1 -0.3,0z"
     fill="rgb(255,255,255)"
     shaper:cutDepth="0"
     shaper:pathType="interior"
     stroke="rgb(0,0,0)"
     transform="matrix(1,0,0,-1,26.6121177,78.5)"
     vector-effect="non-scaling-stroke"
     id="path330"
     style="stroke:#ff0000" /></svg>
