<?xml version="1.0" encoding="UTF-8" standalone="no"?>
<!-- Generator: Fusion 360, Shaper Origin Export Add-In, Version 1.5.0  -->

<svg
   enable-background="new 0 0 25.2 6"
   height="6cm"
   shaper:fusionaddin="version:1.5.0"
   version="1.1"
   viewBox="0 0 25.2 6"
   width="25.2cm"
   x="0cm"
   xml:space="preserve"
   y="0cm"
   id="svg28"
   sodipodi:docname="STD_INTERNAL_SIDE.svg"
   inkscape:version="1.1.1 (3bf5ae0d25, 2021-09-20)"
   xmlns:inkscape="http://www.inkscape.org/namespaces/inkscape"
   xmlns:sodipodi="http://sodipodi.sourceforge.net/DTD/sodipodi-0.dtd"
   xmlns="http://www.w3.org/2000/svg"
   xmlns:svg="http://www.w3.org/2000/svg"
   xmlns:shaper="http://www.shapertools.com/namespaces/shaper"><defs
     id="defs32" /><sodipodi:namedview
     id="namedview30"
     pagecolor="#ffffff"
     bordercolor="#666666"
     borderopacity="1.0"
     inkscape:pageshadow="2"
     inkscape:pageopacity="0.0"
     inkscape:pagecheckerboard="0"
     inkscape:document-units="cm"
     showgrid="false"
     inkscape:zoom="1.11083"
     inkscape:cx="475.77037"
     inkscape:cy="112.97858"
     inkscape:window-width="1366"
     inkscape:window-height="705"
     inkscape:window-x="-8"
     inkscape:window-y="-8"
     inkscape:window-maximized="1"
     inkscape:current-layer="svg28" /><path
     d="M0,0 L25.2,0 25.2,6 0,6 0,0z"
     fill="rgb(0,0,0)"
     shaper:cutDepth="0"
     shaper:pathType="exterior"
     transform="matrix(1,0,0,-1,-0,6)"
     vector-effect="non-scaling-stroke"
     id="path2"
     style="stroke:#0000ff;fill:none" /><path
     d="M7.65,5.5 a0.15,0.15 0 1,1 0.3,0 a0.15,0.15 0 1,1 -0.3,0z"
     fill="rgb(255,255,255)"
     shaper:cutDepth="0"
     shaper:pathType="interior"
     stroke="rgb(0,0,0)"
     transform="matrix(1,0,0,-1,-0,6)"
     vector-effect="non-scaling-stroke"
     id="path4"
     style="stroke:#ff0000" /><path
     d="M20.25,5.5 a0.15,0.15 0 1,1 0.3,0 a0.15,0.15 0 1,1 -0.3,0z"
     fill="rgb(255,255,255)"
     shaper:cutDepth="0"
     shaper:pathType="interior"
     stroke="rgb(0,0,0)"
     transform="matrix(1,0,0,-1,-0,6)"
     vector-effect="non-scaling-stroke"
     id="path6"
     style="stroke:#ff0000" /><path
     d="M4.65,5.5 a0.15,0.15 0 1,1 0.3,0 a0.15,0.15 0 1,1 -0.3,0z"
     fill="rgb(255,255,255)"
     shaper:cutDepth="0"
     shaper:pathType="interior"
     stroke="rgb(0,0,0)"
     transform="matrix(1,0,0,-1,-0,6)"
     vector-effect="non-scaling-stroke"
     id="path8"
     style="stroke:#ff0000" /><path
     d="M17.25,5.5 a0.15,0.15 0 1,1 0.3,0 a0.15,0.15 0 1,1 -0.3,0z"
     fill="rgb(255,255,255)"
     shaper:cutDepth="0"
     shaper:pathType="interior"
     stroke="rgb(0,0,0)"
     transform="matrix(1,0,0,-1,-0,6)"
     vector-effect="non-scaling-stroke"
     id="path10"
     style="stroke:#ff0000" /><path
     d="M0.85,4.772 a0.15,0.15 0 1,1 0.3,0 a0.15,0.15 0 1,1 -0.3,0z"
     fill="rgb(255,255,255)"
     shaper:cutDepth="0"
     shaper:pathType="interior"
     stroke="rgb(0,0,0)"
     transform="matrix(1,0,0,-1,-0,6)"
     vector-effect="non-scaling-stroke"
     id="path12"
     style="stroke:#ff0000" /><path
     d="M24.05,1.772 a0.15,0.15 0 1,1 0.3,0 a0.15,0.15 0 1,1 -0.3,0z"
     fill="rgb(255,255,255)"
     shaper:cutDepth="0"
     shaper:pathType="interior"
     stroke="rgb(0,0,0)"
     transform="matrix(1,0,0,-1,-0,6)"
     vector-effect="non-scaling-stroke"
     id="path14"
     style="stroke:#ff0000" /><path
     d="M0.85,1.772 a0.15,0.15 0 1,1 0.3,0 a0.15,0.15 0 1,1 -0.3,0z"
     fill="rgb(255,255,255)"
     shaper:cutDepth="0"
     shaper:pathType="interior"
     stroke="rgb(0,0,0)"
     transform="matrix(1,0,0,-1,-0,6)"
     vector-effect="non-scaling-stroke"
     id="path16"
     style="stroke:#ff0000" /><path
     d="M24.05,4.772 a0.15,0.15 0 1,1 0.3,0 a0.15,0.15 0 1,1 -0.3,0z"
     fill="rgb(255,255,255)"
     shaper:cutDepth="0"
     shaper:pathType="interior"
     stroke="rgb(0,0,0)"
     transform="matrix(1,0,0,-1,-0,6)"
     vector-effect="non-scaling-stroke"
     id="path18"
     style="stroke:#ff0000" /><path
     d="M7.65,0.5 a0.15,0.15 0 1,1 0.3,0 a0.15,0.15 0 1,1 -0.3,0z"
     fill="rgb(255,255,255)"
     shaper:cutDepth="0"
     shaper:pathType="interior"
     stroke="rgb(0,0,0)"
     transform="matrix(1,0,0,-1,-0,6)"
     vector-effect="non-scaling-stroke"
     id="path20"
     style="stroke:#ff0000" /><path
     d="M20.25,0.5 a0.15,0.15 0 1,1 0.3,0 a0.15,0.15 0 1,1 -0.3,0z"
     fill="rgb(255,255,255)"
     shaper:cutDepth="0"
     shaper:pathType="interior"
     stroke="rgb(0,0,0)"
     transform="matrix(1,0,0,-1,-0,6)"
     vector-effect="non-scaling-stroke"
     id="path22"
     style="stroke:#ff0000" /><path
     d="M4.65,0.5 a0.15,0.15 0 1,1 0.3,0 a0.15,0.15 0 1,1 -0.3,0z"
     fill="rgb(255,255,255)"
     shaper:cutDepth="0"
     shaper:pathType="interior"
     stroke="rgb(0,0,0)"
     transform="matrix(1,0,0,-1,-0,6)"
     vector-effect="non-scaling-stroke"
     id="path24"
     style="stroke:#ff0000" /><path
     d="M17.25,0.5 a0.15,0.15 0 1,1 0.3,0 a0.15,0.15 0 1,1 -0.3,0z"
     fill="rgb(255,255,255)"
     shaper:cutDepth="0"
     shaper:pathType="interior"
     stroke="rgb(0,0,0)"
     transform="matrix(1,0,0,-1,-0,6)"
     vector-effect="non-scaling-stroke"
     id="path26"
     style="stroke:#ff0000" /></svg>
