\BOOKMARK [0][-]{section*.1}{ACKNOWLEDGMENTS}{}% 1
\BOOKMARK [0][-]{section*.2}{ABSTRACT}{}% 2
\BOOKMARK [0][-]{section*.5}{LIST\040OF\040TABLES}{}% 3
\BOOKMARK [0][-]{section*.7}{LIST\040OF\040FIGURES}{}% 4
\BOOKMARK [0][-]{chapter.1}{to1\040}{}% 5
\BOOKMARK [1][-]{section.1.1}{to1.1\040}{chapter.1}% 6
\BOOKMARK [1][-]{section.1.2}{to1.2\040}{chapter.1}% 7
\BOOKMARK [1][-]{section.1.3}{to1.3\040}{chapter.1}% 8
\BOOKMARK [1][-]{section.1.4}{to1.4\040}{chapter.1}% 9
\BOOKMARK [1][-]{section.1.5}{to1.5\040}{chapter.1}% 10
\BOOKMARK [1][-]{section.1.6}{to1.6\040}{chapter.1}% 11
\BOOKMARK [0][-]{chapter.2}{to2\040}{}% 12
\BOOKMARK [1][-]{section.2.1}{to2.1\040}{chapter.2}% 13
\BOOKMARK [2][-]{subsection.2.1.1}{to2.1.1\040}{section.2.1}% 14
\BOOKMARK [2][-]{subsection.2.1.2}{to2.1.2\040}{section.2.1}% 15
\BOOKMARK [2][-]{subsection.2.1.3}{to2.1.3\040}{section.2.1}% 16
\BOOKMARK [0][-]{chapter.3}{to3\040}{}% 17
\BOOKMARK [1][-]{section.3.1}{to3.1\040}{chapter.3}% 18
