<?xml version="1.0" encoding="UTF-8"?>
<!-- Do not edit this file with editors other than draw.io -->
<!DOCTYPE svg PUBLIC "-//W3C//DTD SVG 1.1//EN" "http://www.w3.org/Graphics/SVG/1.1/DTD/svg11.dtd">
<svg xmlns="http://www.w3.org/2000/svg" xmlns:xlink="http://www.w3.org/1999/xlink" version="1.1" width="521px" height="256px" viewBox="-0.5 -0.5 521 256" content="&lt;mxfile host=&quot;app.diagrams.net&quot; modified=&quot;2024-02-28T08:58:15.612Z&quot; agent=&quot;Mozilla/5.0 (Windows NT 10.0; Win64; x64) AppleWebKit/537.36 (KHTML, like Gecko) Chrome/122.0.0.0 Safari/537.36 Edg/122.0.0.0&quot; etag=&quot;7UBz9ytWIhEmAY0UT_jL&quot; version=&quot;23.1.7&quot; type=&quot;google&quot; scale=&quot;1&quot; border=&quot;0&quot;&gt;&#10;  &lt;diagram name=&quot;Pagina-1&quot; id=&quot;MsUDPfWgGgxst4pnNZw9&quot;&gt;&#10;    &lt;mxGraphModel dx=&quot;763&quot; dy=&quot;428&quot; grid=&quot;1&quot; gridSize=&quot;10&quot; guides=&quot;1&quot; tooltips=&quot;1&quot; connect=&quot;1&quot; arrows=&quot;1&quot; fold=&quot;1&quot; page=&quot;1&quot; pageScale=&quot;1&quot; pageWidth=&quot;827&quot; pageHeight=&quot;1169&quot; math=&quot;0&quot; shadow=&quot;0&quot;&gt;&#10;      &lt;root&gt;&#10;        &lt;mxCell id=&quot;0&quot; /&gt;&#10;        &lt;mxCell id=&quot;1&quot; parent=&quot;0&quot; /&gt;&#10;        &lt;mxCell id=&quot;Zi3QIW9-lcGtdn5x7lc4-1&quot; value=&quot;&quot; style=&quot;rounded=0;whiteSpace=wrap;html=1;fillStyle=auto;fillColor=default;strokeColor=default;&quot; parent=&quot;1&quot; vertex=&quot;1&quot;&gt;&#10;          &lt;mxGeometry x=&quot;169&quot; y=&quot;50&quot; width=&quot;411&quot; height=&quot;230&quot; as=&quot;geometry&quot; /&gt;&#10;        &lt;/mxCell&gt;&#10;        &lt;mxCell id=&quot;Zi3QIW9-lcGtdn5x7lc4-2&quot; value=&quot;&quot; style=&quot;rounded=1;whiteSpace=wrap;html=1;fontSize=16;fillColor=none;&quot; parent=&quot;1&quot; vertex=&quot;1&quot;&gt;&#10;          &lt;mxGeometry x=&quot;199&quot; y=&quot;60&quot; width=&quot;371&quot; height=&quot;120&quot; as=&quot;geometry&quot; /&gt;&#10;        &lt;/mxCell&gt;&#10;        &lt;mxCell id=&quot;Zi3QIW9-lcGtdn5x7lc4-3&quot; value=&quot;UAV1&quot; style=&quot;rounded=1;whiteSpace=wrap;html=1;fontSize=16;&quot; parent=&quot;1&quot; vertex=&quot;1&quot;&gt;&#10;          &lt;mxGeometry x=&quot;219&quot; y=&quot;100&quot; width=&quot;70&quot; height=&quot;60&quot; as=&quot;geometry&quot; /&gt;&#10;        &lt;/mxCell&gt;&#10;        &lt;mxCell id=&quot;Zi3QIW9-lcGtdn5x7lc4-4&quot; value=&quot;UAV2&quot; style=&quot;rounded=1;whiteSpace=wrap;html=1;fontSize=16;&quot; parent=&quot;1&quot; vertex=&quot;1&quot;&gt;&#10;          &lt;mxGeometry x=&quot;344&quot; y=&quot;100&quot; width=&quot;70&quot; height=&quot;60&quot; as=&quot;geometry&quot; /&gt;&#10;        &lt;/mxCell&gt;&#10;        &lt;mxCell id=&quot;Zi3QIW9-lcGtdn5x7lc4-5&quot; value=&quot;UAV3&quot; style=&quot;rounded=1;whiteSpace=wrap;html=1;fontSize=16;&quot; parent=&quot;1&quot; vertex=&quot;1&quot;&gt;&#10;          &lt;mxGeometry x=&quot;480&quot; y=&quot;100&quot; width=&quot;70&quot; height=&quot;60&quot; as=&quot;geometry&quot; /&gt;&#10;        &lt;/mxCell&gt;&#10;        &lt;mxCell id=&quot;Zi3QIW9-lcGtdn5x7lc4-6&quot; value=&quot;PX4&amp;lt;br&amp;gt;#1&quot; style=&quot;rounded=1;whiteSpace=wrap;html=1;fontSize=16;&quot; parent=&quot;1&quot; vertex=&quot;1&quot;&gt;&#10;          &lt;mxGeometry x=&quot;219&quot; y=&quot;200&quot; width=&quot;70&quot; height=&quot;60&quot; as=&quot;geometry&quot; /&gt;&#10;        &lt;/mxCell&gt;&#10;        &lt;mxCell id=&quot;Zi3QIW9-lcGtdn5x7lc4-7&quot; value=&quot;PX4&amp;lt;br&amp;gt;#2&quot; style=&quot;rounded=1;whiteSpace=wrap;html=1;fontSize=16;&quot; parent=&quot;1&quot; vertex=&quot;1&quot;&gt;&#10;          &lt;mxGeometry x=&quot;344&quot; y=&quot;200&quot; width=&quot;70&quot; height=&quot;60&quot; as=&quot;geometry&quot; /&gt;&#10;        &lt;/mxCell&gt;&#10;        &lt;mxCell id=&quot;Zi3QIW9-lcGtdn5x7lc4-8&quot; value=&quot;PX4&amp;lt;br&amp;gt;#3&quot; style=&quot;rounded=1;whiteSpace=wrap;html=1;fontSize=16;&quot; parent=&quot;1&quot; vertex=&quot;1&quot;&gt;&#10;          &lt;mxGeometry x=&quot;480&quot; y=&quot;200&quot; width=&quot;70&quot; height=&quot;60&quot; as=&quot;geometry&quot; /&gt;&#10;        &lt;/mxCell&gt;&#10;        &lt;mxCell id=&quot;Zi3QIW9-lcGtdn5x7lc4-9&quot; value=&quot;&quot; style=&quot;endArrow=classic;startArrow=classic;html=1;rounded=0;fontSize=12;startSize=8;endSize=8;curved=1;entryX=0.5;entryY=0;entryDx=0;entryDy=0;exitX=0.5;exitY=1;exitDx=0;exitDy=0;&quot; parent=&quot;1&quot; source=&quot;Zi3QIW9-lcGtdn5x7lc4-4&quot; target=&quot;Zi3QIW9-lcGtdn5x7lc4-7&quot; edge=&quot;1&quot;&gt;&#10;          &lt;mxGeometry width=&quot;50&quot; height=&quot;50&quot; relative=&quot;1&quot; as=&quot;geometry&quot;&gt;&#10;            &lt;mxPoint x=&quot;405&quot; y=&quot;430&quot; as=&quot;sourcePoint&quot; /&gt;&#10;            &lt;mxPoint x=&quot;405&quot; y=&quot;170&quot; as=&quot;targetPoint&quot; /&gt;&#10;          &lt;/mxGeometry&gt;&#10;        &lt;/mxCell&gt;&#10;        &lt;mxCell id=&quot;Zi3QIW9-lcGtdn5x7lc4-10&quot; value=&quot;&quot; style=&quot;endArrow=classic;startArrow=classic;html=1;rounded=0;fontSize=12;startSize=8;endSize=8;curved=1;entryX=0.5;entryY=0;entryDx=0;entryDy=0;exitX=0.5;exitY=1;exitDx=0;exitDy=0;&quot; parent=&quot;1&quot; source=&quot;Zi3QIW9-lcGtdn5x7lc4-5&quot; target=&quot;Zi3QIW9-lcGtdn5x7lc4-8&quot; edge=&quot;1&quot;&gt;&#10;          &lt;mxGeometry width=&quot;50&quot; height=&quot;50&quot; relative=&quot;1&quot; as=&quot;geometry&quot;&gt;&#10;            &lt;mxPoint x=&quot;404&quot; y=&quot;170&quot; as=&quot;sourcePoint&quot; /&gt;&#10;            &lt;mxPoint x=&quot;404&quot; y=&quot;210&quot; as=&quot;targetPoint&quot; /&gt;&#10;          &lt;/mxGeometry&gt;&#10;        &lt;/mxCell&gt;&#10;        &lt;mxCell id=&quot;Zi3QIW9-lcGtdn5x7lc4-11&quot; value=&quot;&quot; style=&quot;endArrow=classic;startArrow=classic;html=1;rounded=0;fontSize=12;startSize=8;endSize=8;curved=1;exitX=0.5;exitY=1;exitDx=0;exitDy=0;&quot; parent=&quot;1&quot; source=&quot;Zi3QIW9-lcGtdn5x7lc4-3&quot; target=&quot;Zi3QIW9-lcGtdn5x7lc4-6&quot; edge=&quot;1&quot;&gt;&#10;          &lt;mxGeometry width=&quot;50&quot; height=&quot;50&quot; relative=&quot;1&quot; as=&quot;geometry&quot;&gt;&#10;            &lt;mxPoint x=&quot;393&quot; y=&quot;180&quot; as=&quot;sourcePoint&quot; /&gt;&#10;            &lt;mxPoint x=&quot;393&quot; y=&quot;220&quot; as=&quot;targetPoint&quot; /&gt;&#10;          &lt;/mxGeometry&gt;&#10;        &lt;/mxCell&gt;&#10;        &lt;mxCell id=&quot;Zi3QIW9-lcGtdn5x7lc4-12&quot; value=&quot;Gazebo&quot; style=&quot;text;html=1;strokeColor=none;fillColor=none;align=center;verticalAlign=middle;whiteSpace=wrap;rounded=0;fontSize=16;&quot; parent=&quot;1&quot; vertex=&quot;1&quot;&gt;&#10;          &lt;mxGeometry x=&quot;204&quot; y=&quot;60&quot; width=&quot;60&quot; height=&quot;30&quot; as=&quot;geometry&quot; /&gt;&#10;        &lt;/mxCell&gt;&#10;        &lt;mxCell id=&quot;Zi3QIW9-lcGtdn5x7lc4-13&quot; value=&quot;Docker Container&quot; style=&quot;text;html=1;strokeColor=none;fillColor=none;align=center;verticalAlign=middle;whiteSpace=wrap;rounded=0;fontSize=16;rotation=-90;&quot; parent=&quot;1&quot; vertex=&quot;1&quot;&gt;&#10;          &lt;mxGeometry x=&quot;109&quot; y=&quot;110&quot; width=&quot;150&quot; height=&quot;30&quot; as=&quot;geometry&quot; /&gt;&#10;        &lt;/mxCell&gt;&#10;        &lt;mxCell id=&quot;Zi3QIW9-lcGtdn5x7lc4-14&quot; value=&quot;&quot; style=&quot;endArrow=classic;startArrow=classic;html=1;rounded=0;fontSize=12;startSize=8;endSize=8;curved=1;exitX=0.5;exitY=1;exitDx=0;exitDy=0;&quot; parent=&quot;1&quot; source=&quot;Zi3QIW9-lcGtdn5x7lc4-6&quot; edge=&quot;1&quot;&gt;&#10;          &lt;mxGeometry width=&quot;50&quot; height=&quot;50&quot; relative=&quot;1&quot; as=&quot;geometry&quot;&gt;&#10;            &lt;mxPoint x=&quot;350&quot; y=&quot;320&quot; as=&quot;sourcePoint&quot; /&gt;&#10;            &lt;mxPoint x=&quot;254&quot; y=&quot;300&quot; as=&quot;targetPoint&quot; /&gt;&#10;          &lt;/mxGeometry&gt;&#10;        &lt;/mxCell&gt;&#10;        &lt;mxCell id=&quot;Zi3QIW9-lcGtdn5x7lc4-15&quot; value=&quot;&quot; style=&quot;endArrow=classic;startArrow=classic;html=1;rounded=0;fontSize=12;startSize=8;endSize=8;curved=1;exitX=0.5;exitY=1;exitDx=0;exitDy=0;&quot; parent=&quot;1&quot; source=&quot;Zi3QIW9-lcGtdn5x7lc4-7&quot; edge=&quot;1&quot;&gt;&#10;          &lt;mxGeometry width=&quot;50&quot; height=&quot;50&quot; relative=&quot;1&quot; as=&quot;geometry&quot;&gt;&#10;            &lt;mxPoint x=&quot;270&quot; y=&quot;270&quot; as=&quot;sourcePoint&quot; /&gt;&#10;            &lt;mxPoint x=&quot;379&quot; y=&quot;300&quot; as=&quot;targetPoint&quot; /&gt;&#10;          &lt;/mxGeometry&gt;&#10;        &lt;/mxCell&gt;&#10;        &lt;mxCell id=&quot;Zi3QIW9-lcGtdn5x7lc4-16&quot; value=&quot;&quot; style=&quot;endArrow=classic;startArrow=classic;html=1;rounded=0;fontSize=12;startSize=8;endSize=8;curved=1;exitX=0.5;exitY=1;exitDx=0;exitDy=0;&quot; parent=&quot;1&quot; source=&quot;Zi3QIW9-lcGtdn5x7lc4-8&quot; edge=&quot;1&quot;&gt;&#10;          &lt;mxGeometry width=&quot;50&quot; height=&quot;50&quot; relative=&quot;1&quot; as=&quot;geometry&quot;&gt;&#10;            &lt;mxPoint x=&quot;295&quot; y=&quot;280&quot; as=&quot;sourcePoint&quot; /&gt;&#10;            &lt;mxPoint x=&quot;515&quot; y=&quot;300&quot; as=&quot;targetPoint&quot; /&gt;&#10;          &lt;/mxGeometry&gt;&#10;        &lt;/mxCell&gt;&#10;        &lt;mxCell id=&quot;Zi3QIW9-lcGtdn5x7lc4-17&quot; value=&quot;TCP 4560&quot; style=&quot;text;html=1;strokeColor=none;fillColor=none;align=center;verticalAlign=middle;whiteSpace=wrap;rounded=0;fontSize=5;&quot; parent=&quot;1&quot; vertex=&quot;1&quot;&gt;&#10;          &lt;mxGeometry x=&quot;219&quot; y=&quot;160&quot; width=&quot;30&quot; height=&quot;15&quot; as=&quot;geometry&quot; /&gt;&#10;        &lt;/mxCell&gt;&#10;        &lt;mxCell id=&quot;Zi3QIW9-lcGtdn5x7lc4-18&quot; value=&quot;TCP 4561&quot; style=&quot;text;html=1;strokeColor=none;fillColor=none;align=center;verticalAlign=middle;whiteSpace=wrap;rounded=0;fontSize=5;&quot; parent=&quot;1&quot; vertex=&quot;1&quot;&gt;&#10;          &lt;mxGeometry x=&quot;344&quot; y=&quot;160&quot; width=&quot;30&quot; height=&quot;15&quot; as=&quot;geometry&quot; /&gt;&#10;        &lt;/mxCell&gt;&#10;        &lt;mxCell id=&quot;Zi3QIW9-lcGtdn5x7lc4-19&quot; value=&quot;Random port&quot; style=&quot;text;html=1;strokeColor=none;fillColor=none;align=center;verticalAlign=middle;whiteSpace=wrap;rounded=0;fontSize=5;&quot; parent=&quot;1&quot; vertex=&quot;1&quot;&gt;&#10;          &lt;mxGeometry x=&quot;219&quot; y=&quot;183&quot; width=&quot;30&quot; height=&quot;15&quot; as=&quot;geometry&quot; /&gt;&#10;        &lt;/mxCell&gt;&#10;        &lt;mxCell id=&quot;Zi3QIW9-lcGtdn5x7lc4-20&quot; value=&quot;Random port&quot; style=&quot;text;html=1;strokeColor=none;fillColor=none;align=center;verticalAlign=middle;whiteSpace=wrap;rounded=0;fontSize=5;&quot; parent=&quot;1&quot; vertex=&quot;1&quot;&gt;&#10;          &lt;mxGeometry x=&quot;344&quot; y=&quot;183&quot; width=&quot;30&quot; height=&quot;15&quot; as=&quot;geometry&quot; /&gt;&#10;        &lt;/mxCell&gt;&#10;        &lt;mxCell id=&quot;Zi3QIW9-lcGtdn5x7lc4-21&quot; value=&quot;TCP 4562&quot; style=&quot;text;html=1;strokeColor=none;fillColor=none;align=center;verticalAlign=middle;whiteSpace=wrap;rounded=0;fontSize=5;&quot; parent=&quot;1&quot; vertex=&quot;1&quot;&gt;&#10;          &lt;mxGeometry x=&quot;480&quot; y=&quot;160&quot; width=&quot;30&quot; height=&quot;15&quot; as=&quot;geometry&quot; /&gt;&#10;        &lt;/mxCell&gt;&#10;        &lt;mxCell id=&quot;Zi3QIW9-lcGtdn5x7lc4-22&quot; value=&quot;Random port&quot; style=&quot;text;html=1;strokeColor=none;fillColor=none;align=center;verticalAlign=middle;whiteSpace=wrap;rounded=0;fontSize=5;&quot; parent=&quot;1&quot; vertex=&quot;1&quot;&gt;&#10;          &lt;mxGeometry x=&quot;480&quot; y=&quot;183&quot; width=&quot;30&quot; height=&quot;15&quot; as=&quot;geometry&quot; /&gt;&#10;        &lt;/mxCell&gt;&#10;        &lt;mxCell id=&quot;Zi3QIW9-lcGtdn5x7lc4-23&quot; value=&quot;UDP&amp;amp;nbsp;2020&amp;lt;span style=&amp;quot;background-color: transparent; color: rgb(255, 255, 255); font-family: source-code-pro, Menlo, Monaco, Consolas, &amp;amp;quot;Courier New&amp;amp;quot;, monospace; font-size: 0.85em; text-align: left;&amp;quot;&amp;gt;&amp;lt;/span&amp;gt;&quot; style=&quot;text;html=1;strokeColor=none;fillColor=none;align=center;verticalAlign=middle;whiteSpace=wrap;rounded=0;fontSize=5;&quot; parent=&quot;1&quot; vertex=&quot;1&quot;&gt;&#10;          &lt;mxGeometry x=&quot;219&quot; y=&quot;290&quot; width=&quot;30&quot; height=&quot;15&quot; as=&quot;geometry&quot; /&gt;&#10;        &lt;/mxCell&gt;&#10;        &lt;mxCell id=&quot;Zi3QIW9-lcGtdn5x7lc4-24&quot; value=&quot;UDP&amp;amp;nbsp;2022&amp;lt;span style=&amp;quot;background-color: transparent; color: rgb(255, 255, 255); font-family: source-code-pro, Menlo, Monaco, Consolas, &amp;amp;quot;Courier New&amp;amp;quot;, monospace; font-size: 0.85em; text-align: left;&amp;quot;&amp;gt;&amp;lt;/span&amp;gt;&quot; style=&quot;text;html=1;strokeColor=none;fillColor=none;align=center;verticalAlign=middle;whiteSpace=wrap;rounded=0;fontSize=5;&quot; parent=&quot;1&quot; vertex=&quot;1&quot;&gt;&#10;          &lt;mxGeometry x=&quot;344&quot; y=&quot;290&quot; width=&quot;30&quot; height=&quot;15&quot; as=&quot;geometry&quot; /&gt;&#10;        &lt;/mxCell&gt;&#10;        &lt;mxCell id=&quot;Zi3QIW9-lcGtdn5x7lc4-25&quot; value=&quot;UDP&amp;amp;nbsp;2024&amp;lt;span style=&amp;quot;background-color: transparent; color: rgb(255, 255, 255); font-family: source-code-pro, Menlo, Monaco, Consolas, &amp;amp;quot;Courier New&amp;amp;quot;, monospace; font-size: 0.85em; text-align: left;&amp;quot;&amp;gt;&amp;lt;/span&amp;gt;&quot; style=&quot;text;html=1;strokeColor=none;fillColor=none;align=center;verticalAlign=middle;whiteSpace=wrap;rounded=0;fontSize=5;&quot; parent=&quot;1&quot; vertex=&quot;1&quot;&gt;&#10;          &lt;mxGeometry x=&quot;480&quot; y=&quot;290&quot; width=&quot;30&quot; height=&quot;15&quot; as=&quot;geometry&quot; /&gt;&#10;        &lt;/mxCell&gt;&#10;        &lt;mxCell id=&quot;Zi3QIW9-lcGtdn5x7lc4-26&quot; value=&quot;UDP&amp;amp;nbsp;2019&amp;lt;span style=&amp;quot;background-color: transparent; color: rgb(255, 255, 255); font-family: source-code-pro, Menlo, Monaco, Consolas, &amp;amp;quot;Courier New&amp;amp;quot;, monospace; font-size: 0.85em; text-align: left;&amp;quot;&amp;gt;&amp;lt;/span&amp;gt;&quot; style=&quot;text;html=1;strokeColor=none;fillColor=none;align=center;verticalAlign=middle;whiteSpace=wrap;rounded=0;fontSize=5;&quot; parent=&quot;1&quot; vertex=&quot;1&quot;&gt;&#10;          &lt;mxGeometry x=&quot;219&quot; y=&quot;260&quot; width=&quot;30&quot; height=&quot;15&quot; as=&quot;geometry&quot; /&gt;&#10;        &lt;/mxCell&gt;&#10;        &lt;mxCell id=&quot;Zi3QIW9-lcGtdn5x7lc4-27&quot; value=&quot;UDP&amp;amp;nbsp;2021&amp;lt;span style=&amp;quot;background-color: transparent; color: rgb(255, 255, 255); font-family: source-code-pro, Menlo, Monaco, Consolas, &amp;amp;quot;Courier New&amp;amp;quot;, monospace; font-size: 0.85em; text-align: left;&amp;quot;&amp;gt;&amp;lt;/span&amp;gt;&quot; style=&quot;text;html=1;strokeColor=none;fillColor=none;align=center;verticalAlign=middle;whiteSpace=wrap;rounded=0;fontSize=5;&quot; parent=&quot;1&quot; vertex=&quot;1&quot;&gt;&#10;          &lt;mxGeometry x=&quot;344&quot; y=&quot;260&quot; width=&quot;30&quot; height=&quot;15&quot; as=&quot;geometry&quot; /&gt;&#10;        &lt;/mxCell&gt;&#10;        &lt;mxCell id=&quot;Zi3QIW9-lcGtdn5x7lc4-28&quot; value=&quot;UDP&amp;amp;nbsp;2023&amp;lt;span style=&amp;quot;background-color: transparent; color: rgb(255, 255, 255); font-family: source-code-pro, Menlo, Monaco, Consolas, &amp;amp;quot;Courier New&amp;amp;quot;, monospace; font-size: 0.85em; text-align: left;&amp;quot;&amp;gt;&amp;lt;/span&amp;gt;&quot; style=&quot;text;html=1;strokeColor=none;fillColor=none;align=center;verticalAlign=middle;whiteSpace=wrap;rounded=0;fontSize=5;&quot; parent=&quot;1&quot; vertex=&quot;1&quot;&gt;&#10;          &lt;mxGeometry x=&quot;480&quot; y=&quot;260&quot; width=&quot;30&quot; height=&quot;15&quot; as=&quot;geometry&quot; /&gt;&#10;        &lt;/mxCell&gt;&#10;        &lt;mxCell id=&quot;Zi3QIW9-lcGtdn5x7lc4-29&quot; value=&quot;&quot; style=&quot;endArrow=classic;html=1;rounded=0;fontSize=12;startSize=8;endSize=8;curved=1;exitX=0;exitY=0.5;exitDx=0;exitDy=0;&quot; parent=&quot;1&quot; source=&quot;Zi3QIW9-lcGtdn5x7lc4-6&quot; edge=&quot;1&quot;&gt;&#10;          &lt;mxGeometry width=&quot;50&quot; height=&quot;50&quot; relative=&quot;1&quot; as=&quot;geometry&quot;&gt;&#10;            &lt;mxPoint x=&quot;219&quot; y=&quot;229.81&quot; as=&quot;sourcePoint&quot; /&gt;&#10;            &lt;mxPoint x=&quot;190&quot; y=&quot;230&quot; as=&quot;targetPoint&quot; /&gt;&#10;          &lt;/mxGeometry&gt;&#10;        &lt;/mxCell&gt;&#10;        &lt;mxCell id=&quot;Zi3QIW9-lcGtdn5x7lc4-30&quot; value=&quot;To QGC:&amp;lt;br&amp;gt;UDP 18570&quot; style=&quot;text;html=1;strokeColor=none;fillColor=none;align=center;verticalAlign=middle;whiteSpace=wrap;rounded=0;fontSize=5;&quot; parent=&quot;1&quot; vertex=&quot;1&quot;&gt;&#10;          &lt;mxGeometry x=&quot;189&quot; y=&quot;210&quot; width=&quot;30&quot; height=&quot;15&quot; as=&quot;geometry&quot; /&gt;&#10;        &lt;/mxCell&gt;&#10;        &lt;mxCell id=&quot;Zi3QIW9-lcGtdn5x7lc4-31&quot; value=&quot;To QGC:&amp;lt;br&amp;gt;UDP 18571&quot; style=&quot;text;html=1;strokeColor=none;fillColor=none;align=center;verticalAlign=middle;whiteSpace=wrap;rounded=0;fontSize=5;&quot; parent=&quot;1&quot; vertex=&quot;1&quot;&gt;&#10;          &lt;mxGeometry x=&quot;314&quot; y=&quot;210&quot; width=&quot;30&quot; height=&quot;15&quot; as=&quot;geometry&quot; /&gt;&#10;        &lt;/mxCell&gt;&#10;        &lt;mxCell id=&quot;Zi3QIW9-lcGtdn5x7lc4-32&quot; value=&quot;&quot; style=&quot;endArrow=classic;html=1;rounded=0;fontSize=12;startSize=8;endSize=8;curved=1;exitX=0;exitY=0.5;exitDx=0;exitDy=0;&quot; parent=&quot;1&quot; source=&quot;Zi3QIW9-lcGtdn5x7lc4-7&quot; edge=&quot;1&quot;&gt;&#10;          &lt;mxGeometry width=&quot;50&quot; height=&quot;50&quot; relative=&quot;1&quot; as=&quot;geometry&quot;&gt;&#10;            &lt;mxPoint x=&quot;344&quot; y=&quot;230&quot; as=&quot;sourcePoint&quot; /&gt;&#10;            &lt;mxPoint x=&quot;316&quot; y=&quot;230&quot; as=&quot;targetPoint&quot; /&gt;&#10;          &lt;/mxGeometry&gt;&#10;        &lt;/mxCell&gt;&#10;        &lt;mxCell id=&quot;Zi3QIW9-lcGtdn5x7lc4-33&quot; value=&quot;&quot; style=&quot;endArrow=classic;html=1;rounded=0;fontSize=12;startSize=8;endSize=8;curved=1;&quot; parent=&quot;1&quot; edge=&quot;1&quot;&gt;&#10;          &lt;mxGeometry width=&quot;50&quot; height=&quot;50&quot; relative=&quot;1&quot; as=&quot;geometry&quot;&gt;&#10;            &lt;mxPoint x=&quot;481&quot; y=&quot;230&quot; as=&quot;sourcePoint&quot; /&gt;&#10;            &lt;mxPoint x=&quot;451&quot; y=&quot;230&quot; as=&quot;targetPoint&quot; /&gt;&#10;          &lt;/mxGeometry&gt;&#10;        &lt;/mxCell&gt;&#10;        &lt;mxCell id=&quot;Zi3QIW9-lcGtdn5x7lc4-34&quot; value=&quot;To QGC:&amp;lt;br&amp;gt;UDP 18572&quot; style=&quot;text;html=1;strokeColor=none;fillColor=none;align=center;verticalAlign=middle;whiteSpace=wrap;rounded=0;fontSize=5;&quot; parent=&quot;1&quot; vertex=&quot;1&quot;&gt;&#10;          &lt;mxGeometry x=&quot;450&quot; y=&quot;210&quot; width=&quot;30&quot; height=&quot;15&quot; as=&quot;geometry&quot; /&gt;&#10;        &lt;/mxCell&gt;&#10;        &lt;mxCell id=&quot;mncdj24QQtjD9njauRp_-1&quot; value=&quot;GCS&quot; style=&quot;rounded=1;whiteSpace=wrap;html=1;fontSize=16;&quot; parent=&quot;1&quot; vertex=&quot;1&quot;&gt;&#10;          &lt;mxGeometry x=&quot;60&quot; y=&quot;200&quot; width=&quot;70&quot; height=&quot;60&quot; as=&quot;geometry&quot; /&gt;&#10;        &lt;/mxCell&gt;&#10;        &lt;mxCell id=&quot;mncdj24QQtjD9njauRp_-2&quot; value=&quot;&quot; style=&quot;endArrow=classic;html=1;rounded=0;fontSize=12;startSize=8;endSize=8;curved=1;exitX=0;exitY=0.5;exitDx=0;exitDy=0;&quot; parent=&quot;1&quot; edge=&quot;1&quot;&gt;&#10;          &lt;mxGeometry width=&quot;50&quot; height=&quot;50&quot; relative=&quot;1&quot; as=&quot;geometry&quot;&gt;&#10;            &lt;mxPoint x=&quot;159&quot; y=&quot;229.71&quot; as=&quot;sourcePoint&quot; /&gt;&#10;            &lt;mxPoint x=&quot;130&quot; y=&quot;229.71&quot; as=&quot;targetPoint&quot; /&gt;&#10;          &lt;/mxGeometry&gt;&#10;        &lt;/mxCell&gt;&#10;        &lt;mxCell id=&quot;mncdj24QQtjD9njauRp_-3&quot; value=&quot;from PX4:&amp;lt;br&amp;gt;UDP 14550&quot; style=&quot;text;html=1;strokeColor=none;fillColor=none;align=center;verticalAlign=middle;whiteSpace=wrap;rounded=0;fontSize=5;&quot; parent=&quot;1&quot; vertex=&quot;1&quot;&gt;&#10;          &lt;mxGeometry x=&quot;130&quot; y=&quot;210&quot; width=&quot;30&quot; height=&quot;15&quot; as=&quot;geometry&quot; /&gt;&#10;        &lt;/mxCell&gt;&#10;      &lt;/root&gt;&#10;    &lt;/mxGraphModel&gt;&#10;  &lt;/diagram&gt;&#10;&lt;/mxfile&gt;&#10;" style="background-color: rgb(255, 255, 255);"><defs/><rect fill="#ffffff" width="100%" height="100%" x="0" y="0"/><g><rect x="109" y="0" width="411" height="230" fill="rgb(255, 255, 255)" stroke="rgb(0, 0, 0)" pointer-events="all"/><rect x="139" y="10" width="371" height="120" rx="18" ry="18" fill="none" stroke="rgb(0, 0, 0)" pointer-events="all"/><rect x="159" y="50" width="70" height="60" rx="9" ry="9" fill="rgb(255, 255, 255)" stroke="rgb(0, 0, 0)" pointer-events="all"/><g transform="translate(-0.5 -0.5)"><switch><foreignObject pointer-events="none" width="100%" height="100%" requiredFeatures="http://www.w3.org/TR/SVG11/feature#Extensibility" style="overflow: visible; text-align: left;"><div xmlns="http://www.w3.org/1999/xhtml" style="display: flex; align-items: unsafe center; justify-content: unsafe center; width: 68px; height: 1px; padding-top: 80px; margin-left: 160px;"><div data-drawio-colors="color: rgb(0, 0, 0); " style="box-sizing: border-box; font-size: 0px; text-align: center;"><div style="display: inline-block; font-size: 16px; font-family: Helvetica; color: rgb(0, 0, 0); line-height: 1.2; pointer-events: all; white-space: normal; overflow-wrap: normal;">UAV1</div></div></div></foreignObject><text x="194" y="85" fill="rgb(0, 0, 0)" font-family="Helvetica" font-size="16px" text-anchor="middle">UAV1</text></switch></g><rect x="284" y="50" width="70" height="60" rx="9" ry="9" fill="rgb(255, 255, 255)" stroke="rgb(0, 0, 0)" pointer-events="all"/><g transform="translate(-0.5 -0.5)"><switch><foreignObject pointer-events="none" width="100%" height="100%" requiredFeatures="http://www.w3.org/TR/SVG11/feature#Extensibility" style="overflow: visible; text-align: left;"><div xmlns="http://www.w3.org/1999/xhtml" style="display: flex; align-items: unsafe center; justify-content: unsafe center; width: 68px; height: 1px; padding-top: 80px; margin-left: 285px;"><div data-drawio-colors="color: rgb(0, 0, 0); " style="box-sizing: border-box; font-size: 0px; text-align: center;"><div style="display: inline-block; font-size: 16px; font-family: Helvetica; color: rgb(0, 0, 0); line-height: 1.2; pointer-events: all; white-space: normal; overflow-wrap: normal;">UAV2</div></div></div></foreignObject><text x="319" y="85" fill="rgb(0, 0, 0)" font-family="Helvetica" font-size="16px" text-anchor="middle">UAV2</text></switch></g><rect x="420" y="50" width="70" height="60" rx="9" ry="9" fill="rgb(255, 255, 255)" stroke="rgb(0, 0, 0)" pointer-events="all"/><g transform="translate(-0.5 -0.5)"><switch><foreignObject pointer-events="none" width="100%" height="100%" requiredFeatures="http://www.w3.org/TR/SVG11/feature#Extensibility" style="overflow: visible; text-align: left;"><div xmlns="http://www.w3.org/1999/xhtml" style="display: flex; align-items: unsafe center; justify-content: unsafe center; width: 68px; height: 1px; padding-top: 80px; margin-left: 421px;"><div data-drawio-colors="color: rgb(0, 0, 0); " style="box-sizing: border-box; font-size: 0px; text-align: center;"><div style="display: inline-block; font-size: 16px; font-family: Helvetica; color: rgb(0, 0, 0); line-height: 1.2; pointer-events: all; white-space: normal; overflow-wrap: normal;">UAV3</div></div></div></foreignObject><text x="455" y="85" fill="rgb(0, 0, 0)" font-family="Helvetica" font-size="16px" text-anchor="middle">UAV3</text></switch></g><rect x="159" y="150" width="70" height="60" rx="9" ry="9" fill="rgb(255, 255, 255)" stroke="rgb(0, 0, 0)" pointer-events="all"/><g transform="translate(-0.5 -0.5)"><switch><foreignObject pointer-events="none" width="100%" height="100%" requiredFeatures="http://www.w3.org/TR/SVG11/feature#Extensibility" style="overflow: visible; text-align: left;"><div xmlns="http://www.w3.org/1999/xhtml" style="display: flex; align-items: unsafe center; justify-content: unsafe center; width: 68px; height: 1px; padding-top: 180px; margin-left: 160px;"><div data-drawio-colors="color: rgb(0, 0, 0); " style="box-sizing: border-box; font-size: 0px; text-align: center;"><div style="display: inline-block; font-size: 16px; font-family: Helvetica; color: rgb(0, 0, 0); line-height: 1.2; pointer-events: all; white-space: normal; overflow-wrap: normal;">PX4<br />#1</div></div></div></foreignObject><text x="194" y="185" fill="rgb(0, 0, 0)" font-family="Helvetica" font-size="16px" text-anchor="middle">PX4...</text></switch></g><rect x="284" y="150" width="70" height="60" rx="9" ry="9" fill="rgb(255, 255, 255)" stroke="rgb(0, 0, 0)" pointer-events="all"/><g transform="translate(-0.5 -0.5)"><switch><foreignObject pointer-events="none" width="100%" height="100%" requiredFeatures="http://www.w3.org/TR/SVG11/feature#Extensibility" style="overflow: visible; text-align: left;"><div xmlns="http://www.w3.org/1999/xhtml" style="display: flex; align-items: unsafe center; justify-content: unsafe center; width: 68px; height: 1px; padding-top: 180px; margin-left: 285px;"><div data-drawio-colors="color: rgb(0, 0, 0); " style="box-sizing: border-box; font-size: 0px; text-align: center;"><div style="display: inline-block; font-size: 16px; font-family: Helvetica; color: rgb(0, 0, 0); line-height: 1.2; pointer-events: all; white-space: normal; overflow-wrap: normal;">PX4<br />#2</div></div></div></foreignObject><text x="319" y="185" fill="rgb(0, 0, 0)" font-family="Helvetica" font-size="16px" text-anchor="middle">PX4...</text></switch></g><rect x="420" y="150" width="70" height="60" rx="9" ry="9" fill="rgb(255, 255, 255)" stroke="rgb(0, 0, 0)" pointer-events="all"/><g transform="translate(-0.5 -0.5)"><switch><foreignObject pointer-events="none" width="100%" height="100%" requiredFeatures="http://www.w3.org/TR/SVG11/feature#Extensibility" style="overflow: visible; text-align: left;"><div xmlns="http://www.w3.org/1999/xhtml" style="display: flex; align-items: unsafe center; justify-content: unsafe center; width: 68px; height: 1px; padding-top: 180px; margin-left: 421px;"><div data-drawio-colors="color: rgb(0, 0, 0); " style="box-sizing: border-box; font-size: 0px; text-align: center;"><div style="display: inline-block; font-size: 16px; font-family: Helvetica; color: rgb(0, 0, 0); line-height: 1.2; pointer-events: all; white-space: normal; overflow-wrap: normal;">PX4<br />#3</div></div></div></foreignObject><text x="455" y="185" fill="rgb(0, 0, 0)" font-family="Helvetica" font-size="16px" text-anchor="middle">PX4...</text></switch></g><path d="M 319 117.87 Q 319 117.87 319 142.13" fill="none" stroke="rgb(0, 0, 0)" stroke-miterlimit="10" pointer-events="stroke"/><path d="M 319 111.12 L 323.5 120.12 L 319 117.87 L 314.5 120.12 Z" fill="rgb(0, 0, 0)" stroke="rgb(0, 0, 0)" stroke-miterlimit="10" pointer-events="all"/><path d="M 319 148.88 L 314.5 139.88 L 319 142.13 L 323.5 139.88 Z" fill="rgb(0, 0, 0)" stroke="rgb(0, 0, 0)" stroke-miterlimit="10" pointer-events="all"/><path d="M 455 117.87 Q 455 117.87 455 142.13" fill="none" stroke="rgb(0, 0, 0)" stroke-miterlimit="10" pointer-events="stroke"/><path d="M 455 111.12 L 459.5 120.12 L 455 117.87 L 450.5 120.12 Z" fill="rgb(0, 0, 0)" stroke="rgb(0, 0, 0)" stroke-miterlimit="10" pointer-events="all"/><path d="M 455 148.88 L 450.5 139.88 L 455 142.13 L 459.5 139.88 Z" fill="rgb(0, 0, 0)" stroke="rgb(0, 0, 0)" stroke-miterlimit="10" pointer-events="all"/><path d="M 194 117.87 Q 194 117.87 194 142.13" fill="none" stroke="rgb(0, 0, 0)" stroke-miterlimit="10" pointer-events="stroke"/><path d="M 194 111.12 L 198.5 120.12 L 194 117.87 L 189.5 120.12 Z" fill="rgb(0, 0, 0)" stroke="rgb(0, 0, 0)" stroke-miterlimit="10" pointer-events="all"/><path d="M 194 148.88 L 189.5 139.88 L 194 142.13 L 198.5 139.88 Z" fill="rgb(0, 0, 0)" stroke="rgb(0, 0, 0)" stroke-miterlimit="10" pointer-events="all"/><rect x="144" y="10" width="60" height="30" fill="none" stroke="none" pointer-events="all"/><g transform="translate(-0.5 -0.5)"><switch><foreignObject pointer-events="none" width="100%" height="100%" requiredFeatures="http://www.w3.org/TR/SVG11/feature#Extensibility" style="overflow: visible; text-align: left;"><div xmlns="http://www.w3.org/1999/xhtml" style="display: flex; align-items: unsafe center; justify-content: unsafe center; width: 58px; height: 1px; padding-top: 25px; margin-left: 145px;"><div data-drawio-colors="color: rgb(0, 0, 0); " style="box-sizing: border-box; font-size: 0px; text-align: center;"><div style="display: inline-block; font-size: 16px; font-family: Helvetica; color: rgb(0, 0, 0); line-height: 1.2; pointer-events: all; white-space: normal; overflow-wrap: normal;">Gazebo</div></div></div></foreignObject><text x="174" y="30" fill="rgb(0, 0, 0)" font-family="Helvetica" font-size="16px" text-anchor="middle">Gazebo</text></switch></g><rect x="49" y="60" width="150" height="30" fill="none" stroke="none" transform="rotate(-90,124,75)" pointer-events="all"/><g transform="translate(-0.5 -0.5)rotate(-90 123.99999999999989 75)"><switch><foreignObject pointer-events="none" width="100%" height="100%" requiredFeatures="http://www.w3.org/TR/SVG11/feature#Extensibility" style="overflow: visible; text-align: left;"><div xmlns="http://www.w3.org/1999/xhtml" style="display: flex; align-items: unsafe center; justify-content: unsafe center; width: 148px; height: 1px; padding-top: 75px; margin-left: 50px;"><div data-drawio-colors="color: rgb(0, 0, 0); " style="box-sizing: border-box; font-size: 0px; text-align: center;"><div style="display: inline-block; font-size: 16px; font-family: Helvetica; color: rgb(0, 0, 0); line-height: 1.2; pointer-events: all; white-space: normal; overflow-wrap: normal;">Docker Container</div></div></div></foreignObject><text x="124" y="80" fill="rgb(0, 0, 0)" font-family="Helvetica" font-size="16px" text-anchor="middle">Docker Container</text></switch></g><path d="M 194 217.87 Q 194 217.87 194 242.13" fill="none" stroke="rgb(0, 0, 0)" stroke-miterlimit="10" pointer-events="stroke"/><path d="M 194 211.12 L 198.5 220.12 L 194 217.87 L 189.5 220.12 Z" fill="rgb(0, 0, 0)" stroke="rgb(0, 0, 0)" stroke-miterlimit="10" pointer-events="all"/><path d="M 194 248.88 L 189.5 239.88 L 194 242.13 L 198.5 239.88 Z" fill="rgb(0, 0, 0)" stroke="rgb(0, 0, 0)" stroke-miterlimit="10" pointer-events="all"/><path d="M 319 217.87 Q 319 217.87 319 242.13" fill="none" stroke="rgb(0, 0, 0)" stroke-miterlimit="10" pointer-events="stroke"/><path d="M 319 211.12 L 323.5 220.12 L 319 217.87 L 314.5 220.12 Z" fill="rgb(0, 0, 0)" stroke="rgb(0, 0, 0)" stroke-miterlimit="10" pointer-events="all"/><path d="M 319 248.88 L 314.5 239.88 L 319 242.13 L 323.5 239.88 Z" fill="rgb(0, 0, 0)" stroke="rgb(0, 0, 0)" stroke-miterlimit="10" pointer-events="all"/><path d="M 455 217.87 Q 455 217.87 455 242.13" fill="none" stroke="rgb(0, 0, 0)" stroke-miterlimit="10" pointer-events="stroke"/><path d="M 455 211.12 L 459.5 220.12 L 455 217.87 L 450.5 220.12 Z" fill="rgb(0, 0, 0)" stroke="rgb(0, 0, 0)" stroke-miterlimit="10" pointer-events="all"/><path d="M 455 248.88 L 450.5 239.88 L 455 242.13 L 459.5 239.88 Z" fill="rgb(0, 0, 0)" stroke="rgb(0, 0, 0)" stroke-miterlimit="10" pointer-events="all"/><rect x="159" y="110" width="30" height="15" fill="none" stroke="none" pointer-events="all"/><g transform="translate(-0.5 -0.5)"><switch><foreignObject pointer-events="none" width="100%" height="100%" requiredFeatures="http://www.w3.org/TR/SVG11/feature#Extensibility" style="overflow: visible; text-align: left;"><div xmlns="http://www.w3.org/1999/xhtml" style="display: flex; align-items: unsafe center; justify-content: unsafe center; width: 28px; height: 1px; padding-top: 118px; margin-left: 160px;"><div data-drawio-colors="color: rgb(0, 0, 0); " style="box-sizing: border-box; font-size: 0px; text-align: center;"><div style="display: inline-block; font-size: 5px; font-family: Helvetica; color: rgb(0, 0, 0); line-height: 1.2; pointer-events: all; white-space: normal; overflow-wrap: normal;">TCP 4560</div></div></div></foreignObject><text x="174" y="119" fill="rgb(0, 0, 0)" font-family="Helvetica" font-size="5px" text-anchor="middle">TCP 4560</text></switch></g><rect x="284" y="110" width="30" height="15" fill="none" stroke="none" pointer-events="all"/><g transform="translate(-0.5 -0.5)"><switch><foreignObject pointer-events="none" width="100%" height="100%" requiredFeatures="http://www.w3.org/TR/SVG11/feature#Extensibility" style="overflow: visible; text-align: left;"><div xmlns="http://www.w3.org/1999/xhtml" style="display: flex; align-items: unsafe center; justify-content: unsafe center; width: 28px; height: 1px; padding-top: 118px; margin-left: 285px;"><div data-drawio-colors="color: rgb(0, 0, 0); " style="box-sizing: border-box; font-size: 0px; text-align: center;"><div style="display: inline-block; font-size: 5px; font-family: Helvetica; color: rgb(0, 0, 0); line-height: 1.2; pointer-events: all; white-space: normal; overflow-wrap: normal;">TCP 4561</div></div></div></foreignObject><text x="299" y="119" fill="rgb(0, 0, 0)" font-family="Helvetica" font-size="5px" text-anchor="middle">TCP 4561</text></switch></g><rect x="159" y="133" width="30" height="15" fill="none" stroke="none" pointer-events="all"/><g transform="translate(-0.5 -0.5)"><switch><foreignObject pointer-events="none" width="100%" height="100%" requiredFeatures="http://www.w3.org/TR/SVG11/feature#Extensibility" style="overflow: visible; text-align: left;"><div xmlns="http://www.w3.org/1999/xhtml" style="display: flex; align-items: unsafe center; justify-content: unsafe center; width: 28px; height: 1px; padding-top: 141px; margin-left: 160px;"><div data-drawio-colors="color: rgb(0, 0, 0); " style="box-sizing: border-box; font-size: 0px; text-align: center;"><div style="display: inline-block; font-size: 5px; font-family: Helvetica; color: rgb(0, 0, 0); line-height: 1.2; pointer-events: all; white-space: normal; overflow-wrap: normal;">Random port</div></div></div></foreignObject><text x="174" y="142" fill="rgb(0, 0, 0)" font-family="Helvetica" font-size="5px" text-anchor="middle">Random port</text></switch></g><rect x="284" y="133" width="30" height="15" fill="none" stroke="none" pointer-events="all"/><g transform="translate(-0.5 -0.5)"><switch><foreignObject pointer-events="none" width="100%" height="100%" requiredFeatures="http://www.w3.org/TR/SVG11/feature#Extensibility" style="overflow: visible; text-align: left;"><div xmlns="http://www.w3.org/1999/xhtml" style="display: flex; align-items: unsafe center; justify-content: unsafe center; width: 28px; height: 1px; padding-top: 141px; margin-left: 285px;"><div data-drawio-colors="color: rgb(0, 0, 0); " style="box-sizing: border-box; font-size: 0px; text-align: center;"><div style="display: inline-block; font-size: 5px; font-family: Helvetica; color: rgb(0, 0, 0); line-height: 1.2; pointer-events: all; white-space: normal; overflow-wrap: normal;">Random port</div></div></div></foreignObject><text x="299" y="142" fill="rgb(0, 0, 0)" font-family="Helvetica" font-size="5px" text-anchor="middle">Random port</text></switch></g><rect x="420" y="110" width="30" height="15" fill="none" stroke="none" pointer-events="all"/><g transform="translate(-0.5 -0.5)"><switch><foreignObject pointer-events="none" width="100%" height="100%" requiredFeatures="http://www.w3.org/TR/SVG11/feature#Extensibility" style="overflow: visible; text-align: left;"><div xmlns="http://www.w3.org/1999/xhtml" style="display: flex; align-items: unsafe center; justify-content: unsafe center; width: 28px; height: 1px; padding-top: 118px; margin-left: 421px;"><div data-drawio-colors="color: rgb(0, 0, 0); " style="box-sizing: border-box; font-size: 0px; text-align: center;"><div style="display: inline-block; font-size: 5px; font-family: Helvetica; color: rgb(0, 0, 0); line-height: 1.2; pointer-events: all; white-space: normal; overflow-wrap: normal;">TCP 4562</div></div></div></foreignObject><text x="435" y="119" fill="rgb(0, 0, 0)" font-family="Helvetica" font-size="5px" text-anchor="middle">TCP 4562</text></switch></g><rect x="420" y="133" width="30" height="15" fill="none" stroke="none" pointer-events="all"/><g transform="translate(-0.5 -0.5)"><switch><foreignObject pointer-events="none" width="100%" height="100%" requiredFeatures="http://www.w3.org/TR/SVG11/feature#Extensibility" style="overflow: visible; text-align: left;"><div xmlns="http://www.w3.org/1999/xhtml" style="display: flex; align-items: unsafe center; justify-content: unsafe center; width: 28px; height: 1px; padding-top: 141px; margin-left: 421px;"><div data-drawio-colors="color: rgb(0, 0, 0); " style="box-sizing: border-box; font-size: 0px; text-align: center;"><div style="display: inline-block; font-size: 5px; font-family: Helvetica; color: rgb(0, 0, 0); line-height: 1.2; pointer-events: all; white-space: normal; overflow-wrap: normal;">Random port</div></div></div></foreignObject><text x="435" y="142" fill="rgb(0, 0, 0)" font-family="Helvetica" font-size="5px" text-anchor="middle">Random port</text></switch></g><rect x="159" y="240" width="30" height="15" fill="none" stroke="none" pointer-events="all"/><g transform="translate(-0.5 -0.5)"><switch><foreignObject pointer-events="none" width="100%" height="100%" requiredFeatures="http://www.w3.org/TR/SVG11/feature#Extensibility" style="overflow: visible; text-align: left;"><div xmlns="http://www.w3.org/1999/xhtml" style="display: flex; align-items: unsafe center; justify-content: unsafe center; width: 28px; height: 1px; padding-top: 248px; margin-left: 160px;"><div data-drawio-colors="color: rgb(0, 0, 0); " style="box-sizing: border-box; font-size: 0px; text-align: center;"><div style="display: inline-block; font-size: 5px; font-family: Helvetica; color: rgb(0, 0, 0); line-height: 1.2; pointer-events: all; white-space: normal; overflow-wrap: normal;">UDP 2020<span style="background-color: transparent; color: rgb(255, 255, 255); font-family: source-code-pro, Menlo, Monaco, Consolas, &quot;Courier New&quot;, monospace; font-size: 0.85em; text-align: left;"></span></div></div></div></foreignObject><text x="174" y="249" fill="rgb(0, 0, 0)" font-family="Helvetica" font-size="5px" text-anchor="middle">UDP 2020</text></switch></g><rect x="284" y="240" width="30" height="15" fill="none" stroke="none" pointer-events="all"/><g transform="translate(-0.5 -0.5)"><switch><foreignObject pointer-events="none" width="100%" height="100%" requiredFeatures="http://www.w3.org/TR/SVG11/feature#Extensibility" style="overflow: visible; text-align: left;"><div xmlns="http://www.w3.org/1999/xhtml" style="display: flex; align-items: unsafe center; justify-content: unsafe center; width: 28px; height: 1px; padding-top: 248px; margin-left: 285px;"><div data-drawio-colors="color: rgb(0, 0, 0); " style="box-sizing: border-box; font-size: 0px; text-align: center;"><div style="display: inline-block; font-size: 5px; font-family: Helvetica; color: rgb(0, 0, 0); line-height: 1.2; pointer-events: all; white-space: normal; overflow-wrap: normal;">UDP 2022<span style="background-color: transparent; color: rgb(255, 255, 255); font-family: source-code-pro, Menlo, Monaco, Consolas, &quot;Courier New&quot;, monospace; font-size: 0.85em; text-align: left;"></span></div></div></div></foreignObject><text x="299" y="249" fill="rgb(0, 0, 0)" font-family="Helvetica" font-size="5px" text-anchor="middle">UDP 2022</text></switch></g><rect x="420" y="240" width="30" height="15" fill="none" stroke="none" pointer-events="all"/><g transform="translate(-0.5 -0.5)"><switch><foreignObject pointer-events="none" width="100%" height="100%" requiredFeatures="http://www.w3.org/TR/SVG11/feature#Extensibility" style="overflow: visible; text-align: left;"><div xmlns="http://www.w3.org/1999/xhtml" style="display: flex; align-items: unsafe center; justify-content: unsafe center; width: 28px; height: 1px; padding-top: 248px; margin-left: 421px;"><div data-drawio-colors="color: rgb(0, 0, 0); " style="box-sizing: border-box; font-size: 0px; text-align: center;"><div style="display: inline-block; font-size: 5px; font-family: Helvetica; color: rgb(0, 0, 0); line-height: 1.2; pointer-events: all; white-space: normal; overflow-wrap: normal;">UDP 2024<span style="background-color: transparent; color: rgb(255, 255, 255); font-family: source-code-pro, Menlo, Monaco, Consolas, &quot;Courier New&quot;, monospace; font-size: 0.85em; text-align: left;"></span></div></div></div></foreignObject><text x="435" y="249" fill="rgb(0, 0, 0)" font-family="Helvetica" font-size="5px" text-anchor="middle">UDP 2024</text></switch></g><rect x="159" y="210" width="30" height="15" fill="none" stroke="none" pointer-events="all"/><g transform="translate(-0.5 -0.5)"><switch><foreignObject pointer-events="none" width="100%" height="100%" requiredFeatures="http://www.w3.org/TR/SVG11/feature#Extensibility" style="overflow: visible; text-align: left;"><div xmlns="http://www.w3.org/1999/xhtml" style="display: flex; align-items: unsafe center; justify-content: unsafe center; width: 28px; height: 1px; padding-top: 218px; margin-left: 160px;"><div data-drawio-colors="color: rgb(0, 0, 0); " style="box-sizing: border-box; font-size: 0px; text-align: center;"><div style="display: inline-block; font-size: 5px; font-family: Helvetica; color: rgb(0, 0, 0); line-height: 1.2; pointer-events: all; white-space: normal; overflow-wrap: normal;">UDP 2019<span style="background-color: transparent; color: rgb(255, 255, 255); font-family: source-code-pro, Menlo, Monaco, Consolas, &quot;Courier New&quot;, monospace; font-size: 0.85em; text-align: left;"></span></div></div></div></foreignObject><text x="174" y="219" fill="rgb(0, 0, 0)" font-family="Helvetica" font-size="5px" text-anchor="middle">UDP 2019</text></switch></g><rect x="284" y="210" width="30" height="15" fill="none" stroke="none" pointer-events="all"/><g transform="translate(-0.5 -0.5)"><switch><foreignObject pointer-events="none" width="100%" height="100%" requiredFeatures="http://www.w3.org/TR/SVG11/feature#Extensibility" style="overflow: visible; text-align: left;"><div xmlns="http://www.w3.org/1999/xhtml" style="display: flex; align-items: unsafe center; justify-content: unsafe center; width: 28px; height: 1px; padding-top: 218px; margin-left: 285px;"><div data-drawio-colors="color: rgb(0, 0, 0); " style="box-sizing: border-box; font-size: 0px; text-align: center;"><div style="display: inline-block; font-size: 5px; font-family: Helvetica; color: rgb(0, 0, 0); line-height: 1.2; pointer-events: all; white-space: normal; overflow-wrap: normal;">UDP 2021<span style="background-color: transparent; color: rgb(255, 255, 255); font-family: source-code-pro, Menlo, Monaco, Consolas, &quot;Courier New&quot;, monospace; font-size: 0.85em; text-align: left;"></span></div></div></div></foreignObject><text x="299" y="219" fill="rgb(0, 0, 0)" font-family="Helvetica" font-size="5px" text-anchor="middle">UDP 2021</text></switch></g><rect x="420" y="210" width="30" height="15" fill="none" stroke="none" pointer-events="all"/><g transform="translate(-0.5 -0.5)"><switch><foreignObject pointer-events="none" width="100%" height="100%" requiredFeatures="http://www.w3.org/TR/SVG11/feature#Extensibility" style="overflow: visible; text-align: left;"><div xmlns="http://www.w3.org/1999/xhtml" style="display: flex; align-items: unsafe center; justify-content: unsafe center; width: 28px; height: 1px; padding-top: 218px; margin-left: 421px;"><div data-drawio-colors="color: rgb(0, 0, 0); " style="box-sizing: border-box; font-size: 0px; text-align: center;"><div style="display: inline-block; font-size: 5px; font-family: Helvetica; color: rgb(0, 0, 0); line-height: 1.2; pointer-events: all; white-space: normal; overflow-wrap: normal;">UDP 2023<span style="background-color: transparent; color: rgb(255, 255, 255); font-family: source-code-pro, Menlo, Monaco, Consolas, &quot;Courier New&quot;, monospace; font-size: 0.85em; text-align: left;"></span></div></div></div></foreignObject><text x="435" y="219" fill="rgb(0, 0, 0)" font-family="Helvetica" font-size="5px" text-anchor="middle">UDP 2023</text></switch></g><path d="M 159 180 Q 159 180 137.87 180" fill="none" stroke="rgb(0, 0, 0)" stroke-miterlimit="10" pointer-events="stroke"/><path d="M 131.12 180 L 140.12 175.5 L 137.87 180 L 140.12 184.5 Z" fill="rgb(0, 0, 0)" stroke="rgb(0, 0, 0)" stroke-miterlimit="10" pointer-events="all"/><rect x="129" y="160" width="30" height="15" fill="none" stroke="none" pointer-events="all"/><g transform="translate(-0.5 -0.5)"><switch><foreignObject pointer-events="none" width="100%" height="100%" requiredFeatures="http://www.w3.org/TR/SVG11/feature#Extensibility" style="overflow: visible; text-align: left;"><div xmlns="http://www.w3.org/1999/xhtml" style="display: flex; align-items: unsafe center; justify-content: unsafe center; width: 28px; height: 1px; padding-top: 168px; margin-left: 130px;"><div data-drawio-colors="color: rgb(0, 0, 0); " style="box-sizing: border-box; font-size: 0px; text-align: center;"><div style="display: inline-block; font-size: 5px; font-family: Helvetica; color: rgb(0, 0, 0); line-height: 1.2; pointer-events: all; white-space: normal; overflow-wrap: normal;">To QGC:<br />UDP 18570</div></div></div></foreignObject><text x="144" y="169" fill="rgb(0, 0, 0)" font-family="Helvetica" font-size="5px" text-anchor="middle">To QGC:...</text></switch></g><rect x="254" y="160" width="30" height="15" fill="none" stroke="none" pointer-events="all"/><g transform="translate(-0.5 -0.5)"><switch><foreignObject pointer-events="none" width="100%" height="100%" requiredFeatures="http://www.w3.org/TR/SVG11/feature#Extensibility" style="overflow: visible; text-align: left;"><div xmlns="http://www.w3.org/1999/xhtml" style="display: flex; align-items: unsafe center; justify-content: unsafe center; width: 28px; height: 1px; padding-top: 168px; margin-left: 255px;"><div data-drawio-colors="color: rgb(0, 0, 0); " style="box-sizing: border-box; font-size: 0px; text-align: center;"><div style="display: inline-block; font-size: 5px; font-family: Helvetica; color: rgb(0, 0, 0); line-height: 1.2; pointer-events: all; white-space: normal; overflow-wrap: normal;">To QGC:<br />UDP 18571</div></div></div></foreignObject><text x="269" y="169" fill="rgb(0, 0, 0)" font-family="Helvetica" font-size="5px" text-anchor="middle">To QGC:...</text></switch></g><path d="M 284 180 Q 284 180 263.87 180" fill="none" stroke="rgb(0, 0, 0)" stroke-miterlimit="10" pointer-events="stroke"/><path d="M 257.12 180 L 266.12 175.5 L 263.87 180 L 266.12 184.5 Z" fill="rgb(0, 0, 0)" stroke="rgb(0, 0, 0)" stroke-miterlimit="10" pointer-events="all"/><path d="M 421 180 Q 421 180 398.87 180" fill="none" stroke="rgb(0, 0, 0)" stroke-miterlimit="10" pointer-events="stroke"/><path d="M 392.12 180 L 401.12 175.5 L 398.87 180 L 401.12 184.5 Z" fill="rgb(0, 0, 0)" stroke="rgb(0, 0, 0)" stroke-miterlimit="10" pointer-events="all"/><rect x="390" y="160" width="30" height="15" fill="none" stroke="none" pointer-events="all"/><g transform="translate(-0.5 -0.5)"><switch><foreignObject pointer-events="none" width="100%" height="100%" requiredFeatures="http://www.w3.org/TR/SVG11/feature#Extensibility" style="overflow: visible; text-align: left;"><div xmlns="http://www.w3.org/1999/xhtml" style="display: flex; align-items: unsafe center; justify-content: unsafe center; width: 28px; height: 1px; padding-top: 168px; margin-left: 391px;"><div data-drawio-colors="color: rgb(0, 0, 0); " style="box-sizing: border-box; font-size: 0px; text-align: center;"><div style="display: inline-block; font-size: 5px; font-family: Helvetica; color: rgb(0, 0, 0); line-height: 1.2; pointer-events: all; white-space: normal; overflow-wrap: normal;">To QGC:<br />UDP 18572</div></div></div></foreignObject><text x="405" y="169" fill="rgb(0, 0, 0)" font-family="Helvetica" font-size="5px" text-anchor="middle">To QGC:...</text></switch></g><rect x="0" y="150" width="70" height="60" rx="9" ry="9" fill="rgb(255, 255, 255)" stroke="rgb(0, 0, 0)" pointer-events="all"/><g transform="translate(-0.5 -0.5)"><switch><foreignObject pointer-events="none" width="100%" height="100%" requiredFeatures="http://www.w3.org/TR/SVG11/feature#Extensibility" style="overflow: visible; text-align: left;"><div xmlns="http://www.w3.org/1999/xhtml" style="display: flex; align-items: unsafe center; justify-content: unsafe center; width: 68px; height: 1px; padding-top: 180px; margin-left: 1px;"><div data-drawio-colors="color: rgb(0, 0, 0); " style="box-sizing: border-box; font-size: 0px; text-align: center;"><div style="display: inline-block; font-size: 16px; font-family: Helvetica; color: rgb(0, 0, 0); line-height: 1.2; pointer-events: all; white-space: normal; overflow-wrap: normal;">GCS</div></div></div></foreignObject><text x="35" y="185" fill="rgb(0, 0, 0)" font-family="Helvetica" font-size="16px" text-anchor="middle">GCS</text></switch></g><path d="M 99 179.71 Q 99 179.71 77.87 179.71" fill="none" stroke="rgb(0, 0, 0)" stroke-miterlimit="10" pointer-events="stroke"/><path d="M 71.12 179.71 L 80.12 175.21 L 77.87 179.71 L 80.12 184.21 Z" fill="rgb(0, 0, 0)" stroke="rgb(0, 0, 0)" stroke-miterlimit="10" pointer-events="all"/><rect x="70" y="160" width="30" height="15" fill="none" stroke="none" pointer-events="all"/><g transform="translate(-0.5 -0.5)"><switch><foreignObject pointer-events="none" width="100%" height="100%" requiredFeatures="http://www.w3.org/TR/SVG11/feature#Extensibility" style="overflow: visible; text-align: left;"><div xmlns="http://www.w3.org/1999/xhtml" style="display: flex; align-items: unsafe center; justify-content: unsafe center; width: 28px; height: 1px; padding-top: 168px; margin-left: 71px;"><div data-drawio-colors="color: rgb(0, 0, 0); " style="box-sizing: border-box; font-size: 0px; text-align: center;"><div style="display: inline-block; font-size: 5px; font-family: Helvetica; color: rgb(0, 0, 0); line-height: 1.2; pointer-events: all; white-space: normal; overflow-wrap: normal;">from PX4:<br />UDP 14550</div></div></div></foreignObject><text x="85" y="169" fill="rgb(0, 0, 0)" font-family="Helvetica" font-size="5px" text-anchor="middle">from PX4:...</text></switch></g></g></svg>