,"num_confinement","debut_confinement","fin_confinement"
0,"confinement_1",2020-03-17 00:00:00,2020-05-11 00:00:00
1,"confinement_2",2020-10-30 00:00:00,2020-12-15 00:00:00
2,"confinement_3",2021-04-03 00:00:00,2021-05-03 00:00:00
